"study_id","Tment","demographics_sect","gender_w0","PrEth","age_w0","agegp_w0","NZDep_Decile","baseline_clinical_sect","previous_backpain_w0","previous_backpain_w0_imp","backpain_consistency_3f","d_length_back_pain_weeks","baseline_outcomes_sect","rmdq_tot_base","nprs1_base","nprs2_base","drs_base","euroqol5d_tot_base","pseq2_1_base","pseq2_2_base","pseq2_tot_mod_base_imp","fearavoidance1_base","fearavoidance2_base","fearavoid_tot_mod_base","anxiety_base","catastrophisation_base","expectation4wk_base","expectation4wk_base_imp","expectation3mth_base","expectation3mth_base_imp","satisfaction1_base","satisfaction2_base","gp_baseline_sect","GP","practice_code","pracsize_strata","hcpairs_tot_w0","followup_outcomes_sect","week","rmdq_tot","nprs1","nprs2","drs","euroqol5d_tot","pseq2_1","pseq2_2","pseq2_tot_mod","fearavoidance1","fearavoidance2","fearavoid_tot_mod","anxiety","catastrophisation","expectation4wk","expectation3mth","satisfaction1","satisfaction2","satisfaction3"
"lbp_15-27","FREE",,"Female","REMOVED",56,"[55,65)",2,,"I have had back pain in the past","I have had back pain in the past","Not chronic",0.857142857142857,,14,6,,5,0.5558,6,3,4.5,2,4,3,2,1,7,7,7,7,5,3,,11,4,"Larger",36,,2,4,3,0,4,,7,6,6.5,1,3,2,2,1,7,7,5,5,1
"lbp_15-27","FREE",,"Female","REMOVED",56,"[55,65)",2,,"I have had back pain in the past","I have had back pain in the past","Not chronic",0.857142857142857,,14,6,,5,0.5558,6,3,4.5,2,4,3,2,1,7,7,7,7,5,3,,11,4,"Larger",36,,6,1,0,0,0,,7,7,7,1,1,1,2,1,7,7,,5,5
"lbp_15-27","FREE",,"Female","REMOVED",56,"[55,65)",2,,"I have had back pain in the past","I have had back pain in the past","Not chronic",0.857142857142857,,14,6,,5,0.5558,6,3,4.5,2,4,3,2,1,7,7,7,7,5,3,,11,4,"Larger",36,,12,3,1,0,1,1,,,,,,,,,,,,,
"lbp_15-27","FREE",,"Female","REMOVED",56,"[55,65)",2,,"I have had back pain in the past","I have had back pain in the past","Not chronic",0.857142857142857,,14,6,,5,0.5558,6,3,4.5,2,4,3,2,1,7,7,7,7,5,3,,11,4,"Larger",36,,26,0,0,5,0,0.6272,,,,,,,,,,,,5,5
"lbp_15-28","FREE",,"Female","REMOVED",45,"[45,55)",5,,"I have had back pain in the past","I have had back pain in the past","Not chronic",0.285714285714286,,16,9,8,8,0.2595,5,4,4.5,6,6,6,3,1,7,7,7,7,5,5,,11,4,"Larger",36,,2,6,3,3,3,,5,7,6,5,5,5,2,1,6,7,5,5,2
"lbp_15-28","FREE",,"Female","REMOVED",45,"[45,55)",5,,"I have had back pain in the past","I have had back pain in the past","Not chronic",0.285714285714286,,16,9,8,8,0.2595,5,4,4.5,6,6,6,3,1,7,7,7,7,5,5,,11,4,"Larger",36,,6,4,2,3,1,,7,7,7,6,2,4,2,1,7,7,,5,4
"lbp_15-28","FREE",,"Female","REMOVED",45,"[45,55)",5,,"I have had back pain in the past","I have had back pain in the past","Not chronic",0.285714285714286,,16,9,8,8,0.2595,5,4,4.5,6,6,6,3,1,7,7,7,7,5,5,,11,4,"Larger",36,,12,2,1,2,2,0.7039,,,,,,,,,,,,,
"lbp_15-28","FREE",,"Female","REMOVED",45,"[45,55)",5,,"I have had back pain in the past","I have had back pain in the past","Not chronic",0.285714285714286,,16,9,8,8,0.2595,5,4,4.5,6,6,6,3,1,7,7,7,7,5,5,,11,4,"Larger",36,,26,6,2,3,1,0.7161,,,,,,,,,,,,5,2
"lbp_15-50","FREE",,"Male","REMOVED",39,"[35,45)",9,,"I have had back pain in the past","I have had back pain in the past","Not chronic",2.14285714285714,,3,2,2,3,0.7161,6,6,6,4,5,4.5,4,1,5,5,6,6,3,4,,11,4,"Larger",36,,2,0,2,0,1,,6,6,6,5,3,4,4,1,6,6,3,3,2
"lbp_15-50","FREE",,"Male","REMOVED",39,"[35,45)",9,,"I have had back pain in the past","I have had back pain in the past","Not chronic",2.14285714285714,,3,2,2,3,0.7161,6,6,6,4,5,4.5,4,1,5,5,6,6,3,4,,11,4,"Larger",36,,6,0,1,0,0,,7,7,7,2,6,4,2,2,7,7,,3,2
"lbp_15-50","FREE",,"Male","REMOVED",39,"[35,45)",9,,"I have had back pain in the past","I have had back pain in the past","Not chronic",2.14285714285714,,3,2,2,3,0.7161,6,6,6,4,5,4.5,4,1,5,5,6,6,3,4,,11,4,"Larger",36,,12,0,1,0,0,1,,,,,,,,,,,,,
"lbp_15-50","FREE",,"Male","REMOVED",39,"[35,45)",9,,"I have had back pain in the past","I have had back pain in the past","Not chronic",2.14285714285714,,3,2,2,3,0.7161,6,6,6,4,5,4.5,4,1,5,5,6,6,3,4,,11,4,"Larger",36,,26,0,0,1,0,0.7161,,,,,,,,,,,,3,2
"lbp_15-5","FREE",,"Male","REMOVED",62,"[55,65)",6,,"I have had back pain in the past","I have had back pain in the past","Not chronic",1,,14,8,0,7,0.2595,1,2,1.5,6,5,5.5,4,4,6,6,7,7,5,5,,12,4,"Larger",30,,2,6,6,0,5,,3,3,3,5,5,5,4,3,6,6,4,3,1
"lbp_15-5","FREE",,"Male","REMOVED",62,"[55,65)",6,,"I have had back pain in the past","I have had back pain in the past","Not chronic",1,,14,8,0,7,0.2595,1,2,1.5,6,5,5.5,4,4,6,6,7,7,5,5,,12,4,"Larger",30,,6,0,1,0,1,,,2,2,6,6,6,1,1,7,7,,4,4
"lbp_15-5","FREE",,"Male","REMOVED",62,"[55,65)",6,,"I have had back pain in the past","I have had back pain in the past","Not chronic",1,,14,8,0,7,0.2595,1,2,1.5,6,5,5.5,4,4,6,6,7,7,5,5,,12,4,"Larger",30,,12,1,2,0,1,0.7161,,,,,,,,,,,,,
"lbp_15-5","FREE",,"Male","REMOVED",62,"[55,65)",6,,"I have had back pain in the past","I have had back pain in the past","Not chronic",1,,14,8,0,7,0.2595,1,2,1.5,6,5,5.5,4,4,6,6,7,7,5,5,,12,4,"Larger",30,,26,0,1,0,0,1,,,,,,,,,,,,5,4
"lbp_15-7","FREE",,"Male","REMOVED",65,"[65,89]",3,,"I have had back pain in the past","I have had back pain in the past","Not chronic",0.428571428571429,,16,10,0,10,0.00409999999999988,3,1,2,7,7,7,5,1,7,7,7,7,5,5,,12,4,"Larger",30,,2,0,2,0,4,,6,6,6,4,6,5,7,3,7,7,5,5,2
"lbp_15-7","FREE",,"Male","REMOVED",65,"[65,89]",3,,"I have had back pain in the past","I have had back pain in the past","Not chronic",0.428571428571429,,16,10,0,10,0.00409999999999988,3,1,2,7,7,7,5,1,7,7,7,7,5,5,,12,4,"Larger",30,,6,3,2,0,6,,6,5,5.5,4,3,3.5,2,4,4,4,,4,3
"lbp_15-7","FREE",,"Male","REMOVED",65,"[65,89]",3,,"I have had back pain in the past","I have had back pain in the past","Not chronic",0.428571428571429,,16,10,0,10,0.00409999999999988,3,1,2,7,7,7,5,1,7,7,7,7,5,5,,12,4,"Larger",30,,12,0,0,0,0,1,,,,,,,,,,,,,
"lbp_15-7","FREE",,"Male","REMOVED",65,"[65,89]",3,,"I have had back pain in the past","I have had back pain in the past","Not chronic",0.428571428571429,,16,10,0,10,0.00409999999999988,3,1,2,7,7,7,5,1,7,7,7,7,5,5,,12,4,"Larger",30,,26,2,3,1,2,0.7161,,,,,,,,,,,,4,2
"lbp_15-8","FREE",,"Male","REMOVED",28,"[25,35)",2,,"I have had back pain in the past","I have had back pain in the past","Not chronic",0.285714285714286,,5,5,2,6,0.5352,4,3,3.5,6,6,6,5,5,4,4,4,4,4,4,,12,4,"Larger",30,,2,4,3,2,5,,5,4,4.5,4,4,4,4,,4,4,4,3,2
"lbp_15-8","FREE",,"Male","REMOVED",28,"[25,35)",2,,"I have had back pain in the past","I have had back pain in the past","Not chronic",0.285714285714286,,5,5,2,6,0.5352,4,3,3.5,6,6,6,5,5,4,4,4,4,4,4,,12,4,"Larger",30,,6,2,2.5,1.5,3.5,,5,5,5,4,4,4,3,3,5,5,,4,2
"lbp_15-8","FREE",,"Male","REMOVED",28,"[25,35)",2,,"I have had back pain in the past","I have had back pain in the past","Not chronic",0.285714285714286,,5,5,2,6,0.5352,4,3,3.5,6,6,6,5,5,4,4,4,4,4,4,,12,4,"Larger",30,,12,1,4,2,3,0.6272,,,,,,,,,,,,,
"lbp_15-8","FREE",,"Male","REMOVED",28,"[25,35)",2,,"I have had back pain in the past","I have had back pain in the past","Not chronic",0.285714285714286,,5,5,2,6,0.5352,4,3,3.5,6,6,6,5,5,4,4,4,4,4,4,,12,4,"Larger",30,,26,1,3,2,2,0.7025,,,,,,,,,,,,3,3
"lbp_15-13","FREE",,"Male","REMOVED",43,"[35,45)",1,,"I have had back pain in the past","I have had back pain in the past","Not chronic",4,,7,4,1,3,0.6105,6,5,5.5,6,6,6,5,5,6,6,6,6,4,4,,12,4,"Larger",30,,2,3,2,0,2,,6,5,5.5,5,6,5.5,4,3,6,6,4,4,2
"lbp_15-13","FREE",,"Male","REMOVED",43,"[35,45)",1,,"I have had back pain in the past","I have had back pain in the past","Not chronic",4,,7,4,1,3,0.6105,6,5,5.5,6,6,6,5,5,6,6,6,6,4,4,,12,4,"Larger",30,,6,1,1,1,1,,6,6,6,5,6,5.5,5,2,6,6,,4,2
"lbp_15-13","FREE",,"Male","REMOVED",43,"[35,45)",1,,"I have had back pain in the past","I have had back pain in the past","Not chronic",4,,7,4,1,3,0.6105,6,5,5.5,6,6,6,5,5,6,6,6,6,4,4,,12,4,"Larger",30,,12,1,1,2,1,1,,,,,,,,,,,,,
"lbp_15-13","FREE",,"Male","REMOVED",43,"[35,45)",1,,"I have had back pain in the past","I have had back pain in the past","Not chronic",4,,7,4,1,3,0.6105,6,5,5.5,6,6,6,5,5,6,6,6,6,4,4,,12,4,"Larger",30,,26,2,1,2,1,1,,,,,,,,,,,,4,2
"lbp_14-7","FREE",,"Female","REMOVED",53,"[45,55)",8,,"I have had back pain in the past","I have had back pain in the past","Not chronic",0.571428571428571,,12,9,1,8,0.2595,3,3,3,2,5,3.5,2,1,6,6,7,7,1,1,,12,4,"Larger",30,,2,2,2,0,2,,7,7,7,1,5,3,1,1,7,7,5,5,5
"lbp_14-7","FREE",,"Female","REMOVED",53,"[45,55)",8,,"I have had back pain in the past","I have had back pain in the past","Not chronic",0.571428571428571,,12,9,1,8,0.2595,3,3,3,2,5,3.5,2,1,6,6,7,7,1,1,,12,4,"Larger",30,,6,0,0,0,0,,7,7,7,2,6,4,1,1,7,4,,5,4
"lbp_14-7","FREE",,"Female","REMOVED",53,"[45,55)",8,,"I have had back pain in the past","I have had back pain in the past","Not chronic",0.571428571428571,,12,9,1,8,0.2595,3,3,3,2,5,3.5,2,1,6,6,7,7,1,1,,12,4,"Larger",30,,12,0,2,0,1,1,,,,,,,,,,,,,
"lbp_14-7","FREE",,"Female","REMOVED",53,"[45,55)",8,,"I have had back pain in the past","I have had back pain in the past","Not chronic",0.571428571428571,,12,9,1,8,0.2595,3,3,3,2,5,3.5,2,1,6,6,7,7,1,1,,12,4,"Larger",30,,26,1,1,0,0,0.7245,,,,,,,,,,,,1,1
"lbp_15-47","FREE",,"Male","REMOVED",50,"[45,55)",6,,"I have had back pain in the past","I have had back pain in the past","Fairly constant",24,,14,8,8,6,0.5558,5,5,5,3,2,2.5,5,3,6,6,6,6,4,4,,12,4,"Larger",30,,2,8,5,5,4,,7,6,6.5,2,2,2,6,2,6,6,4,4,2
"lbp_15-47","FREE",,"Male","REMOVED",50,"[45,55)",6,,"I have had back pain in the past","I have had back pain in the past","Fairly constant",24,,14,8,8,6,0.5558,5,5,5,3,2,2.5,5,3,6,6,6,6,4,4,,12,4,"Larger",30,,6,13,3,2,2,,5,5,5,2,2,2,3,2,6,6,,4,1
"lbp_15-47","FREE",,"Male","REMOVED",50,"[45,55)",6,,"I have had back pain in the past","I have had back pain in the past","Fairly constant",24,,14,8,8,6,0.5558,5,5,5,3,2,2.5,5,3,6,6,6,6,4,4,,12,4,"Larger",30,,12,15,5,0,3,,,,,,,,,,,,,,
"lbp_15-47","FREE",,"Male","REMOVED",50,"[45,55)",6,,"I have had back pain in the past","I have had back pain in the past","Fairly constant",24,,14,8,8,6,0.5558,5,5,5,3,2,2.5,5,3,6,6,6,6,4,4,,12,4,"Larger",30,,26,11,3,3,3,0.6272,,,,,,,,,,,,3,2
"lbp_15-51","FREE",,"Male","REMOVED",34,"[25,35)",5,,"I have had back pain in the past","I have had back pain in the past","Not chronic",2,,11,7,7,7,0.6105,4,3,3.5,6,7,6.5,7,5,4,4,6,6,5,5,,12,4,"Larger",30,,2,4,2,5,0,,6,6,6,6,6,6,6,4,7,7,2,2,1
"lbp_15-51","FREE",,"Male","REMOVED",34,"[25,35)",5,,"I have had back pain in the past","I have had back pain in the past","Not chronic",2,,11,7,7,7,0.6105,4,3,3.5,6,7,6.5,7,5,4,4,6,6,5,5,,12,4,"Larger",30,,6,1,0,0,0,,6,7,6.5,7,6,6.5,6,1,7,7,,5,5
"lbp_15-51","FREE",,"Male","REMOVED",34,"[25,35)",5,,"I have had back pain in the past","I have had back pain in the past","Not chronic",2,,11,7,7,7,0.6105,4,3,3.5,6,7,6.5,7,5,4,4,6,6,5,5,,12,4,"Larger",30,,12,0,0,0,0,0.7039,,,,,,,,,,,,,
"lbp_15-51","FREE",,"Male","REMOVED",34,"[25,35)",5,,"I have had back pain in the past","I have had back pain in the past","Not chronic",2,,11,7,7,7,0.6105,4,3,3.5,6,7,6.5,7,5,4,4,6,6,5,5,,12,4,"Larger",30,,26,0,0,0,0,1,,,,,,,,,,,,5,1
"lbp_15-2","FREE",,"Male","REMOVED",64,"[55,65)",1,,"I have had back pain in the past","I have had back pain in the past","Not chronic",1.57142857142857,,7,9,8,7,0.3309,6,4,5,3,3,3,6,2,6,6,6,6,5,5,,13,4,"Larger",36,,2,4,4,7,3,,7,5,6,1,1,1,5,3,7,7,5,4,1
"lbp_15-2","FREE",,"Male","REMOVED",64,"[55,65)",1,,"I have had back pain in the past","I have had back pain in the past","Not chronic",1.57142857142857,,7,9,8,7,0.3309,6,4,5,3,3,3,6,2,6,6,6,6,5,5,,13,4,"Larger",36,,6,1,1,3,0,,7,7,7,1,1,1,2,1,7,7,,,2
"lbp_15-2","FREE",,"Male","REMOVED",64,"[55,65)",1,,"I have had back pain in the past","I have had back pain in the past","Not chronic",1.57142857142857,,7,9,8,7,0.3309,6,4,5,3,3,3,6,2,6,6,6,6,5,5,,13,4,"Larger",36,,12,0,1,1,0,0.7161,,,,,,,,,,,,,
"lbp_15-2","FREE",,"Male","REMOVED",64,"[55,65)",1,,"I have had back pain in the past","I have had back pain in the past","Not chronic",1.57142857142857,,7,9,8,7,0.3309,6,4,5,3,3,3,6,2,6,6,6,6,5,5,,13,4,"Larger",36,,26,0,1,1,0,1,,,,,,,,,,,,5,5
"lbp_15-34","FREE",,"Male","REMOVED",56,"[55,65)",3,,"I have had back pain in the past","I have had back pain in the past","Not chronic",0.428571428571429,,14,8,0,8,0.5558,2,2,2,7,7,7,6,5,6,6,5,5,5,5,,13,4,"Larger",36,,2,3,2,0,1,,7,6,6.5,7,7,7,2,1,6,7,5,5,2
"lbp_15-34","FREE",,"Male","REMOVED",56,"[55,65)",3,,"I have had back pain in the past","I have had back pain in the past","Not chronic",0.428571428571429,,14,8,0,8,0.5558,2,2,2,7,7,7,6,5,6,6,5,5,5,5,,13,4,"Larger",36,,6,0,0,0,0,,,6,6,6,7,6.5,2,1,7,7,,5,4
"lbp_15-34","FREE",,"Male","REMOVED",56,"[55,65)",3,,"I have had back pain in the past","I have had back pain in the past","Not chronic",0.428571428571429,,14,8,0,8,0.5558,2,2,2,7,7,7,6,5,6,6,5,5,5,5,,13,4,"Larger",36,,12,3,2,3,1,0.7823,,,,,,,,,,,,,
"lbp_15-34","FREE",,"Male","REMOVED",56,"[55,65)",3,,"I have had back pain in the past","I have had back pain in the past","Not chronic",0.428571428571429,,14,8,0,8,0.5558,2,2,2,7,7,7,6,5,6,6,5,5,5,5,,13,4,"Larger",36,,26,2,0,0,0,0.7245,,,,,,,,,,,,5,1
"lbp_15-36","FREE",,"Female","REMOVED",47,"[45,55)",10,,"I have had back pain in the past","I have had back pain in the past","Not chronic",1,,8,5,0,5,0.6272,3,3,3,4,4,4,5,3,5,5,5,5,5,4,,13,4,"Larger",36,,2,9,5,0,5,,7,5,6,4,6,5,5,1,4,4,3,3,1
"lbp_15-36","FREE",,"Female","REMOVED",47,"[45,55)",10,,"I have had back pain in the past","I have had back pain in the past","Not chronic",1,,8,5,0,5,0.6272,3,3,3,4,4,4,5,3,5,5,5,5,5,4,,13,4,"Larger",36,,6,9,6,0,5,,5,5,5,5,5,5,6,1,,,,4,1
"lbp_15-36","FREE",,"Female","REMOVED",47,"[45,55)",10,,"I have had back pain in the past","I have had back pain in the past","Not chronic",1,,8,5,0,5,0.6272,3,3,3,4,4,4,5,3,5,5,5,5,5,4,,13,4,"Larger",36,,12,2,3,0,5,0.7025,,,,,,,,,,,,,
"lbp_15-36","FREE",,"Female","REMOVED",47,"[45,55)",10,,"I have had back pain in the past","I have had back pain in the past","Not chronic",1,,8,5,0,5,0.6272,3,3,3,4,4,4,5,3,5,5,5,5,5,4,,13,4,"Larger",36,,26,4,3,0,0,0.6311,,,,,,,,,,,,4,4
"lbp_15-37","FREE",,"Male","REMOVED",40,"[35,45)",5,,"I have had back pain in the past","I have had back pain in the past","Not chronic",0.857142857142857,,15,5,4,7,0.4638,1,7,4,4,7,5.5,5,1,7,7,4,4,5,5,,13,4,"Larger",36,,2,7,5,2,5,,4,6,5,5,6,5.5,3,1,4,7,4,4,1
"lbp_15-37","FREE",,"Male","REMOVED",40,"[35,45)",5,,"I have had back pain in the past","I have had back pain in the past","Not chronic",0.857142857142857,,15,5,4,7,0.4638,1,7,4,4,7,5.5,5,1,7,7,4,4,5,5,,13,4,"Larger",36,,6,2,5,7,4,,4,5,4.5,7,7,7,3,1,4,7,,3,1
"lbp_15-37","FREE",,"Male","REMOVED",40,"[35,45)",5,,"I have had back pain in the past","I have had back pain in the past","Not chronic",0.857142857142857,,15,5,4,7,0.4638,1,7,4,4,7,5.5,5,1,7,7,4,4,5,5,,13,4,"Larger",36,,12,3,3,0,3,0.5558,,,,,,,,,,,,,
"lbp_15-37","FREE",,"Male","REMOVED",40,"[35,45)",5,,"I have had back pain in the past","I have had back pain in the past","Not chronic",0.857142857142857,,15,5,4,7,0.4638,1,7,4,4,7,5.5,5,1,7,7,4,4,5,5,,13,4,"Larger",36,,26,1,2,1,2,0.7025,,,,,,,,,,,,5,1
"lbp_15-9","FREE",,"Female","REMOVED",53,"[45,55)",7,,"I have had back pain in the past","I have had back pain in the past","Not chronic",0.142857142857143,,18,9,1,8,0.1539,2,2,2,2,2,2,5,1,6,6,7,7,5,5,,14,4,"Larger",46,,2,0,0,0,0,,7,7,7,1,1,1,1,1,7,7,5,5,5
"lbp_15-9","FREE",,"Female","REMOVED",53,"[45,55)",7,,"I have had back pain in the past","I have had back pain in the past","Not chronic",0.142857142857143,,18,9,1,8,0.1539,2,2,2,2,2,2,5,1,6,6,7,7,5,5,,14,4,"Larger",46,,6,0,0,0,0,,7,7,7,1,1,1,1,1,7,7,,5,5
"lbp_15-9","FREE",,"Female","REMOVED",53,"[45,55)",7,,"I have had back pain in the past","I have had back pain in the past","Not chronic",0.142857142857143,,18,9,1,8,0.1539,2,2,2,2,2,2,5,1,6,6,7,7,5,5,,14,4,"Larger",46,,12,0,0,0,0,1,,,,,,,,,,,,,
"lbp_15-9","FREE",,"Female","REMOVED",53,"[45,55)",7,,"I have had back pain in the past","I have had back pain in the past","Not chronic",0.142857142857143,,18,9,1,8,0.1539,2,2,2,2,2,2,5,1,6,6,7,7,5,5,,14,4,"Larger",46,,26,0,0,0,0,1,,,,,,,,,,,,5,5
"lbp_15-20","FREE",,"Male","REMOVED",30,"[25,35)",7,,"I have never had back pain before now","I have never had back pain before now","Not chronic",0.285714285714286,,18,8,0,9,0.2595,3,1,2,4,7,5.5,2,1,6,6,7,7,5,5,,14,4,"Larger",46,,2,0,1,0,1,,7,7,7,4,5,4.5,5,1,7,7,4,4,3
"lbp_15-20","FREE",,"Male","REMOVED",30,"[25,35)",7,,"I have never had back pain before now","I have never had back pain before now","Not chronic",0.285714285714286,,18,8,0,9,0.2595,3,1,2,4,7,5.5,2,1,6,6,7,7,5,5,,14,4,"Larger",46,,6,0,0,0,0,,7,7,7,4,1,2.5,2,1,7,7,,4,3
"lbp_15-20","FREE",,"Male","REMOVED",30,"[25,35)",7,,"I have never had back pain before now","I have never had back pain before now","Not chronic",0.285714285714286,,18,8,0,9,0.2595,3,1,2,4,7,5.5,2,1,6,6,7,7,5,5,,14,4,"Larger",46,,12,0,0,0,0,0.7039,,,,,,,,,,,,,
"lbp_15-20","FREE",,"Male","REMOVED",30,"[25,35)",7,,"I have never had back pain before now","I have never had back pain before now","Not chronic",0.285714285714286,,18,8,0,9,0.2595,3,1,2,4,7,5.5,2,1,6,6,7,7,5,5,,14,4,"Larger",46,,26,2,1,0,0,1,,,,,,,,,,,,5,3
"lbp_15-32","FREE",,"Female","REMOVED",47,"[45,55)",2,,"I have had back pain in the past","I have had back pain in the past","Comes and goes",8,,6,4,4,2,0.6408,6,6,6,3,5,4,5,2,7,7,7,7,3,4,,14,4,"Larger",46,,2,1,2,1,0,,7,7,7,4,5,4.5,2,1,7,7,3,5,2
"lbp_15-32","FREE",,"Female","REMOVED",47,"[45,55)",2,,"I have had back pain in the past","I have had back pain in the past","Comes and goes",8,,6,4,4,2,0.6408,6,6,6,3,5,4,5,2,7,7,7,7,3,4,,14,4,"Larger",46,,6,0,2,3,0,,7,7,7,4,4,4,5,1,7,7,,1,2
"lbp_15-32","FREE",,"Female","REMOVED",47,"[45,55)",2,,"I have had back pain in the past","I have had back pain in the past","Comes and goes",8,,6,4,4,2,0.6408,6,6,6,3,5,4,5,2,7,7,7,7,3,4,,14,4,"Larger",46,,12,0,2,0,0,0.6241,,,,,,,,,,,,,
"lbp_15-32","FREE",,"Female","REMOVED",47,"[45,55)",2,,"I have had back pain in the past","I have had back pain in the past","Comes and goes",8,,6,4,4,2,0.6408,6,6,6,3,5,4,5,2,7,7,7,7,3,4,,14,4,"Larger",46,,26,1,2,0,0,1,,,,,,,,,,,,5,4
"lbp_15-10","FREE",,"Female","REMOVED",51,"[45,55)",3,,"I have had back pain in the past","I have had back pain in the past","Not chronic",2.85714285714286,,19,8,9,7,0.2389,2,3,2.5,6,6,6,7,4,6,6,6,6,4,4,,14,4,"Larger",46,,2,0,,,,,,,,,,,,,,,,,
"lbp_15-10","FREE",,"Female","REMOVED",51,"[45,55)",3,,"I have had back pain in the past","I have had back pain in the past","Not chronic",2.85714285714286,,19,8,9,7,0.2389,2,3,2.5,6,6,6,7,4,6,6,6,6,4,4,,14,4,"Larger",46,,6,3,6,7,5,,5,5,5,4,4,4,5,5,6,6,,3,1
"lbp_15-10","FREE",,"Female","REMOVED",51,"[45,55)",3,,"I have had back pain in the past","I have had back pain in the past","Not chronic",2.85714285714286,,19,8,9,7,0.2389,2,3,2.5,6,6,6,7,4,6,6,6,6,4,4,,14,4,"Larger",46,,12,4,5,5,5,0.6272,,,,,,,,,,,,,
"lbp_15-10","FREE",,"Female","REMOVED",51,"[45,55)",3,,"I have had back pain in the past","I have had back pain in the past","Not chronic",2.85714285714286,,19,8,9,7,0.2389,2,3,2.5,6,6,6,7,4,6,6,6,6,4,4,,14,4,"Larger",46,,26,16,6,7,6,0.4638,,,,,,,,,,,,2,1
"lbp_15-12","FREE",,"Male","REMOVED",57,"[55,65)",4,,"I have had back pain in the past","I have had back pain in the past","Not chronic",2,,10,5,4,6,0.2337,3,3,3,4,4,4,5,6,3,3,3,3,3,3,,15,4,"Larger",30,,2,15,4,3,7,,5,3,4,6,6,6,6,5,4,6,3,3,1
"lbp_15-12","FREE",,"Male","REMOVED",57,"[55,65)",4,,"I have had back pain in the past","I have had back pain in the past","Not chronic",2,,10,5,4,6,0.2337,3,3,3,4,4,4,5,6,3,3,3,3,3,3,,15,4,"Larger",30,,6,13,3,3,4,,5,3,4,5,5,5,5,5,5,6,,4,1
"lbp_15-12","FREE",,"Male","REMOVED",57,"[55,65)",4,,"I have had back pain in the past","I have had back pain in the past","Not chronic",2,,10,5,4,6,0.2337,3,3,3,4,4,4,5,6,3,3,3,3,3,3,,15,4,"Larger",30,,12,7,3,3,3,0.5558,,,,,,,,,,,,,
"lbp_15-12","FREE",,"Male","REMOVED",57,"[55,65)",4,,"I have had back pain in the past","I have had back pain in the past","Not chronic",2,,10,5,4,6,0.2337,3,3,3,4,4,4,5,6,3,3,3,3,3,3,,15,4,"Larger",30,,26,0,1,1,1,0.7245,,,,,,,,,,,,4,4
"lbp_15-15","FREE",,"Female","REMOVED",39,"[35,45)",9,,"I have had back pain in the past","I have had back pain in the past","Not chronic",3,,14,7,6,6,0.5558,7,6,6.5,4,3,3.5,1,1,4,4,4,4,5,5,,15,4,"Larger",30,,2,16,4,4,3,,7,5,6,1,1,1,1,1,5,6,2,2,1
"lbp_15-15","FREE",,"Female","REMOVED",39,"[35,45)",9,,"I have had back pain in the past","I have had back pain in the past","Not chronic",3,,14,7,6,6,0.5558,7,6,6.5,4,3,3.5,1,1,4,4,4,4,5,5,,15,4,"Larger",30,,6,15,6,5,5,,6,6,6,4,4,4,3,1,4,4,,2,1
"lbp_15-15","FREE",,"Female","REMOVED",39,"[35,45)",9,,"I have had back pain in the past","I have had back pain in the past","Not chronic",3,,14,7,6,6,0.5558,7,6,6.5,4,3,3.5,1,1,4,4,4,4,5,5,,15,4,"Larger",30,,12,3,3,4,1,0.6272,,,,,,,,,,,,,
"lbp_15-15","FREE",,"Female","REMOVED",39,"[35,45)",9,,"I have had back pain in the past","I have had back pain in the past","Not chronic",3,,14,7,6,6,0.5558,7,6,6.5,4,3,3.5,1,1,4,4,4,4,5,5,,15,4,"Larger",30,,26,0,3,1,,0.6408,,,,,,,,,,,,1,1
"lbp_15-21","FREE",,"Male","REMOVED",49,"[45,55)",3,,"I have had back pain in the past","I have had back pain in the past","Not chronic",0.571428571428571,,13,5,2,5,0.4638,4,4,4,5,4,4.5,5,5,2,2,4,4,5,5,,15,4,"Larger",30,,2,8,6,5,4,,4,4,4,4,4,4,6,6,4,4,2,2,1
"lbp_15-21","FREE",,"Male","REMOVED",49,"[45,55)",3,,"I have had back pain in the past","I have had back pain in the past","Not chronic",0.571428571428571,,13,5,2,5,0.4638,4,4,4,5,4,4.5,5,5,2,2,4,4,5,5,,15,4,"Larger",30,,6,13,5,4,6,,5,5,5,3,4,3.5,6,7,5,5,,3,1
"lbp_15-21","FREE",,"Male","REMOVED",49,"[45,55)",3,,"I have had back pain in the past","I have had back pain in the past","Not chronic",0.571428571428571,,13,5,2,5,0.4638,4,4,4,5,4,4.5,5,5,2,2,4,4,5,5,,15,4,"Larger",30,,12,6,6,6,6,0.4638,,,,,,,,,,,,,
"lbp_15-21","FREE",,"Male","REMOVED",49,"[45,55)",3,,"I have had back pain in the past","I have had back pain in the past","Not chronic",0.571428571428571,,13,5,2,5,0.4638,4,4,4,5,4,4.5,5,5,2,2,4,4,5,5,,15,4,"Larger",30,,26,9,8,6,4,0.4638,,,,,,,,,,,,3,1
"lbp_15-29","FREE",,"Male","REMOVED",53,"[45,55)",6,,"I have had back pain in the past","I have had back pain in the past","Not chronic",0.571428571428571,,7,6,5,6,0.6272,5,5,5,7,7,7,6,5,6,6,7,7,5,5,,15,4,"Larger",30,,2,1,0,0,1,,7,7,7,1,1,1,2,1,7,7,5,5,4
"lbp_15-29","FREE",,"Male","REMOVED",53,"[45,55)",6,,"I have had back pain in the past","I have had back pain in the past","Not chronic",0.571428571428571,,7,6,5,6,0.6272,5,5,5,7,7,7,6,5,6,6,7,7,5,5,,15,4,"Larger",30,,6,2,1,0,1,,7,7,7,7,2,4.5,2,1,7,7,,5,4
"lbp_15-29","FREE",,"Male","REMOVED",53,"[45,55)",6,,"I have had back pain in the past","I have had back pain in the past","Not chronic",0.571428571428571,,7,6,5,6,0.6272,5,5,5,7,7,7,6,5,6,6,7,7,5,5,,15,4,"Larger",30,,12,0,0,0,0,1,,,,,,,,,,,,,
"lbp_15-29","FREE",,"Male","REMOVED",53,"[45,55)",6,,"I have had back pain in the past","I have had back pain in the past","Not chronic",0.571428571428571,,7,6,5,6,0.6272,5,5,5,7,7,7,6,5,6,6,7,7,5,5,,15,4,"Larger",30,,26,0,1,0,1,1,,,,,,,,,,,,5,4
"lbp_15-30","FREE",,"Male","REMOVED",19,"[18,25)",1,,"I have had back pain in the past","I have had back pain in the past","Not chronic",2,,8,8,0,8,0.6272,4,6,5,5,6,5.5,6,2,3,3,4,4,5,5,,15,4,"Larger",30,,2,4,5,0,6,,4,4,4,,,,7,4,4,4,3,4,1
"lbp_15-30","FREE",,"Male","REMOVED",19,"[18,25)",1,,"I have had back pain in the past","I have had back pain in the past","Not chronic",2,,8,8,0,8,0.6272,4,6,5,5,6,5.5,6,2,3,3,4,4,5,5,,15,4,"Larger",30,,6,8,4,0,4,,5,5,5,7,7,7,6,4,5,5,,4,1
"lbp_15-30","FREE",,"Male","REMOVED",19,"[18,25)",1,,"I have had back pain in the past","I have had back pain in the past","Not chronic",2,,8,8,0,8,0.6272,4,6,5,5,6,5.5,6,2,3,3,4,4,5,5,,15,4,"Larger",30,,12,3,5,0,5,0.7025,,,,,,,,,,,,,