﻿Count,Band Number,Band-Year,Colors,Test Num,PIT Num,Date Caught,Julian date,Num Date,Band-Date,Batch,Year,Blood ID,Site,SiteUM8,Site-Year,Box,Site-Box,SiteRec,dist um,dist road,dist path,in closed area,Recapture?,Who Measured,Sex,Sex Num,Age,Age Num,Recruit,Tarsus,Wing,Weight In,Weight Out,Wt Change,Test Cage,Lights out,Time Test,Personality sequence,Exploration score,SNP27pr,SNP30pr,SNP31pr,SNP100pr,SNP115pr,SNP250pr,SNP288pr,SNP295pr,SNP415pr,SNP438pr,SNP562pr,SNP592pr,SNP663pr,SNP160pr,pr153,SNP163exon1,SNP187exon1,SNP226exon1,SNP100exon3,SNP110exon3,SNP125exon3,SNP170exon3,SNP187exon3,SNP51exon5,SNP36exon6,SNP48exon9,SNP51exon9,SNP84exon9,SNP144exon12,SNP66exon13
159,58v87753,58v87753-2017,mb-C,1,030003AACA,42760,2017025,25,58v87753 2017025,AP,2017,UM-14,UM,UM,UM-2017,k7,UM k7,UM,84.89,32.12,9.47,N,N,andrea,F,2,ASY,2,0,20.42,71,18.84,16.7,2.14,15,0.792361111,0.411805556,1HW23HW241W14HW25H24W24W14W2W25W4W1,24,,,,,,,,,,,,,,,,,,,CC,GG,GG,CC,TT,CC,CT,GG,CC,TT,,CT
610,58v87753,58v87753-2018,mb-C,2,030003AACA,43132,2018032,32,58v87753 2018032,AU,2018,UM-50,UM,UM,UM-2018,k26,UM k26,UM,123.66,76.29,43.73,N,Y,peter,F,2,ASY,2,0,20.29,73,18.7,16.6,2.1,6,0.791666667,0.390972222,425W42H5HH3234H1HH43HH2H3W25H32W3135HHW41243H2433,44,,,,,,,,,,,,,,,,,,,CC,GG,GG,CC,TT,CC,CT,GG,CC,TT,,CT
732,58v91036,58v91036-2018,mg-Gw,1,110170198,43161,2018061,61,58v91036 2018061,AV,2018,F8-62,F8,UM,UM-2018,k15,UM k15,UM,153.2,55.51,19.56,N,N,peter,F,2,SY,1,0,18.89,70,16.84,15.9,0.94,13,0.865972222,0.379861111,W313W23H1H134HHH32134H5H31H,24,AA,CC,AA,AA,CC,GG,GG,GG,CC,TC,TT,CC,GG,,,,,,CC,GG,GG,CG,TT,CC,CT,GG,CC,CT,CC,CC
884,60v45668,60v45668-2019,mb-pr,1,,43507,2019042,42,60v45668 2019042,2019G,2019,UM-93,UM,UM,UM-2019,k13,UM k13,UM,197.46,21.27,18.17,N,,andrea,M,1,SY,1,0,20.31,75,18.46,16.8,1.66,8,0.794444444,0.39375,31351H353HH5W443,14,,,,,,,,,,,,,,,,,,,CC,GG,GG,CC,TT,,CC,GG,CC,TT,CC,CT
894,58v87753,58v87753-2019,mb-Cx,3,030003AACA,43508,2019043,43,58v87753 2019043,2019H,2019,UM-103,UM,UM,UM-2019,k26,UM k26,UM,123.66,76.29,43.73,N,,andrea,F,2,ASY,2,0,19.56,73,18.57,16.6,1.97,12,0.792361111,0.365277778,1W2W44H5W44HW25W413HH5W31W2435W4W35HW4431W2553HH51W2,39,,,,,,,,,,,,,,,,,,,CC,GG,GG,CC,TT,CC,CT,GG,CC,TT,,CT
184,56v87904,56v87904-2017,zz-my,1,,42765,2017030,30,56v87904 2017030,B,2017,F4-17,F4,F4,F4-2017,k5,F4 k5,F4,8096.47,183.35,28.15,Y,Y,melissa,M,1,ASY,2,0,20.59,74,17.14,15.7,1.44,9,0.790277778,0.359722222,W2W4W42W413H,7,AA,CC,AA,AA,CC,GG,GG,GG,TT,CC,TT,TT,GG,GG,AA,AA,CC,TT,CT,GG,GG,CC,TT,CC,CT,AG,TT,CT,CC,CC
396,58v87572,58v87572-2017,gm-R,1,0700EDB374,42793,2017058,58,58v87572 2017058,AS,2017,UM-31,UM,UM,UM-2017,k2,UM k2,UM,252.56,46.73,39.39,N,N,andrea,F,2,ASY,2,0,19.52,73,16.96,15.6,1.36,7,0.913194444,0.368055556,13543W123H3H23H4431H,18,AA,CC,AA,AA,AA,AA,GG,GG,CC,CC,TT,TT,GG,GG,AA,AA,CC,TT,CC,GG,GG,CC,TT,CC,CC,GG,CC,CC,CC,CC
636,55v70163,55v70163-2018,mp-gZ,1,0700EDBE03,43137,2018037,37,55v70163 2018037,AL,2018,UM-59,UM,UM,UM-2018,k28,UM k28,UM,227.54,118.53,26.16,N,Y,peter,F,2,ASY,2,0,19.81,68,17.41,15.7,1.71,14,0.805555556,0.370833333,W1,0,,,,AA,AA,AA,GG,GG,CC,CC,TC,TT,GG,GG,AA,AA,CC,TT,CC,GG,GG,CC,TT,CC,CC,GG,CC,CT,CC,CC
666,56v87904,56v87904-2018,zz-my,2,,43139,2018039,39,56v87904 2018039,F,2018,F4-67,F4,F4,F4-2018,k5,F4 k5,F4,8137.7,183.35,28.15,Y,Y,peter,M,1,ASY,2,0,19.28,74,17.52,15.5,2.02,16,0.840277778,0.377777778,3,0,AA,CC,AA,AA,CC,GG,GG,GG,TT,CC,TT,TT,GG,GG,AA,AA,CC,TT,CT,GG,GG,CC,TT,CC,CT,AG,TT,CT,CC,CC
731,58v87572,58v87572-2018,gm-xR,2,0700EDB374,43161,2018061,61,58v87572 2018061,AV,2018,UM-65,UM,UM,UM-2018,k1,UM k1,UM,263.47,30.89,60.43,N,Y,peter,F,2,ASY,2,0,19.58,70,18.1,16.2,1.9,12,0.865972222,0.376388889,531HG4H3H235W12H35313H5H1,23,AA,CC,AA,AA,AA,AA,GG,GG,CC,CC,TT,TT,GG,GG,AA,AA,CC,TT,CC,GG,GG,CC,TT,CC,CC,GG,CC,CC,CC,CC
2,56v90597,56v90597-2013,WC-MP,1,300028909,41613,2013339,-26,56v90597 2013339,,2013,,F6,F6,F6-2013,k95,F6 k95,F6,4397.81,62.63,4.33,,,peter,F,2,ASY,2,0,20,75,17.8,,,,,,,14,AA,CC,AA,AA,CC,GG,GG,GG,CT,TC,TT,TT,GG,GG,AA,AG,CC,AT,CC,AG,GG,CC,TT,CC,CT,GG,CC,CT,CC,CC
22,56v90597,56v90597-2015,WC-MP,2,300028909,42046,2015042,42,56v90597 2015042,,2015,,F6,F6,F6-2015,k90B,F6 k90B,F6,0,0,0,,,peter,F,2,ASY,2,0,19.87,73,17.6,,,,,,,10,AA,CC,AA,AA,CC,GG,GG,GG,CT,TC,TT,TT,GG,GG,AA,AG,CC,AT,CC,AG,GG,CC,TT,CC,CT,GG,CC,CT,CC,CC
33,57v77620,57v77620-2015,MZ-OR,1,0700EE380C,42317,2015313,-52,57v77620 2015313,,2015,,F6,F6,F6-2015,k32,F6 k32,F6,4749,121.51,57.81,,,peter,F,2,SY,1,0,19.08,71,17.25,,,,,,,2,AA,CT,AT,AA,CC,GG,GG,GG,CT,TC,TT,CT,GG,GG,AA,AG,CC,TT,CC,GG,AA,CG,AT,CC,CC,GG,CC,CT,CC,CT
87,56v90597,56v90597-2016,WC-MP,3,300028909,42705,2016336,-29,56v90597 2016336,,2016,,F6,F6,F6-2016,k96,F6 k96,F6,4367.57,71.2,7.17,,,peter,F,2,ASY,2,0,20.08,73,18.33,,,,,,,4,AA,CC,AA,AA,CC,GG,GG,GG,CT,TC,TT,TT,GG,GG,AA,AG,CC,AT,CC,AG,GG,CC,TT,CC,CT,GG,CC,CT,CC,CC
105,58v87317,58v87317-2016,MY-YG,1,03000273BB,42712,2016343,-22,58v87317 2016343,,2016,,F6,F6,F6-2016,k46B,F6 k46B,F6,,0,0,,,bert,M,1,SY,1,0,20.21,75,18.19,,,,,,,13,AA,CC,AA,AA,AC,AG,GG,GG,CC,CC,TT,CT,GG,GG,AA,AG,CC,TT,CC,GG,GG,CC,TT,CC,CC,GG,CC,CC,CC,CC
117,57v77620,57v77620-2016,MZ-OR,2,0700EE380C,42717,2016348,-17,57v77620 2016348,,2016,,F6,F6,F6-2016,k32,F6 k32,F6,4749,121.51,57.81,,,bert,F,2,ASY,2,0,19.17,74,17.45,,,,,,,18,AA,CT,AT,AA,CC,GG,GG,GG,CT,TC,TT,CT,GG,GG,AA,AG,CC,TT,CC,GG,AA,CG,AT,CC,CC,GG,CC,CT,CC,CT
145,58v87510,58v87510-2017,GZ-MG,1,300034148,42752,2017017,17,58v87510 2017017,M,2017,,F6,F6,F6-2017,k105,F6 k105,F6,,#N/A,#N/A,,,peter,F,2,ASY,2,0,20.14,75,18.64,,,,,,,0,AA,CC,AA,AA,AC,AG,GG,AG,CC,CC,TT,TT,GG,,AA,AG,CC,AT,CC,GG,GG,CC,TT,CC,TT,GG,CC,TT,CC,CC
154,58v87648,58v87648-2017,mz-rz,1,,42760,2017025,25,58v87648 2017025,AP,2017,UM-11,UM,UM,UM-2017,k4b,UM k4b,UM,79.99,15.73,13.71,N,Y,andrea,M,1,SY,1,0,20.91,75,19.85,17.9,1.95,10,0.792361111,0.400694444,W31GH2HHGHHW35251W15,16,AA,CC,AT,AA,CC,GG,GG,GG,CT,TC,TT,TT,GG,GG,AA,AG,CC,TT,CC,GG,AG,CC,AT,CC,CT,GG,CC,CT,CC,CC
168,56v87922,56v87922-2017,C-mw,1,03000388D1,42761,2017026,26,56v87922 2017026,A,2017,F4-2,F4,F4,F4-2017,k54,F4 k54,F4,8471.49,79.38,16.37,N,Y,melissa,F,2,ASY,2,0,19.63,73,19.01,17.3,1.71,8,0.819444444,0.364583333,33,1,AA,CC,AA,AG,AC,AA,TG,GG,CT,CC,TT,TT,GG,GG,AA,AG,CC,TT,CC,GG,GG,CC,TT,CC,CT,AG,TT,CC,CC,CC
183,54v58679,54v58679-2017,C-my,1,0300037A5D,42765,2017030,30,54v58679 2017030,B,2017,F4-23,F4,F4,F4-2017,k24,F4 k24,F4,8244.02,92.95,8.53,N,Y,andrea,F,2,SY,1,0,19.8,76,18.22,16.8,1.42,14,0.790277778,0.373611111,1W31W44W2W42342W3333W231W232W35W44H3D5,28,AA,CT,AT,AA,CC,GG,GG,GG,CT,TC,TT,CT,GG,GG,AA,AG,CC,TT,CT,GG,GG,CC,TT,CC,CT,AG,CT,CT,CC,CT
197,58v87781,58v87781-2017,mg-Z,1,030001FA4E,42766,2017031,31,58v87781 2017031,AH,2017,F7-14,F7,F7,F7-2017,k11,F7 k11,F7,2247.28,299.44,140.71,Y,N,melissa,F,2,SY,1,0,19.15,72,17.17,15.7,1.47,15,0.783333333,0.359722222,32341W3W34W4533523W253,17,AA,CC,AA,AA,AC,AG,GG,GG,CC,CC,TT,CT,GG,GG,AA,AG,CC,TT,CC,GG,GG,CC,TT,CC,CC,GG,CC,CC,CC,CC
203,58v87787,58v87787-2017,mg-C,1,030001BFA8,42766,2017031,31,58v87787 2017031,AH,2017,F7-4,F7,F7,F7-2017,k61,F7 k61,F7,2512.46,28.68,28.68,Y,N,andrea,F,2,ASY,2,0,19.1,71,16.71,15.4,1.31,7,0.783333333,0.379166667,W4W22H31H35313H13H,15,AA,CC,AA,AG,AA,AA,TG,GG,CT,CC,TT,TT,GG,GG,AA,AG,CC,TT,CC,GG,GG,CC,TT,CC,CT,GG,CC,CT,CC,CT
211,55v70515,55v70515-2017,yw-mg,1,,42768,2017033,33,55v70515 2017033,AQ,2017,UM-20,UM,UM,UM-2017,k28,UM k28,UM,227.54,118.53,26.16,N,Y,andrea,M,1,ASY,2,0,19.9,75,16.81,15.6,1.21,7,0.802083333,0.360416667,23,1,AA,CC,AA,AA,AA,AG,GG,AG,CC,CC,TT,TT,GG,GG,AA,AG,CC,TT,CC,AG,AG,CC,AT,,CT,GG,CC,TT,CC,CC
213,57v77977,57v77977-2017,mr-Y,1,0700EE0654,42768,2017033,33,57v77977 2017033,AQ,2017,UM-24,UM,UM,UM-2017,k3,UM k3,UM,219.61,91.3,21.28,N,N,andrea,F,2,ASY,2,0,20.1,74,17.33,15.7,1.63,3,0.802083333,0.35,2H14H3H1343134533,16,AA,CC,AA,AA,CC,GG,GG,GG,CT,CC,CC,CT,GG,GG,AA,AG,CC,AT,CC,GG,GG,CG,TT,CC,TT,GG,CC,CT,CC,CT
215,58v87792,58v87792-2017,my-gy,1,,42768,2017033,33,58v87792 2017033,AQ,2017,UM-26,UM,UM,UM-2017,k2,UM k2,UM,252.56,46.73,39.39,N,N,melissa,M,1,ASY,2,0,19.91,73,18.83,17.2,1.63,11,0.802083333,0.368055556,3HHH5H3,6,AA,CT,AA,AA,AC,AG,GG,AG,CC,CC,TT,CT,GG,GG,AA,AG,CC,TT,CC,GG,GG,CG,TT,CC,CC,GG,CC,CT,CC,CC
222,58v87799,58v87799-2017,mz-Y,1,0700EE28B8,42768,2017033,33,58v87799 2017033,AQ,2017,UM-22,UM,UM,UM-2017,k24,UM k24,UM,120.54,62.16,31.08,N,N,melissa,F,2,ASY,2,0,19.52,70,17.36,15.7,1.66,4,0.802083333,0.35625,W1,0,AA,CC,AA,AA,CC,GG,GG,GG,CT,TC,TT,CT,GG,GG,AA,AG,CC,TT,CC,GG,AA,CC,AT,CC,CT,GG,CC,CT,CC,CC
240,53v34396,53v34396-2017,Y-mr,1,030003A24E,42774,2017039,39,53v34396 2017039,AI,2017,F7-25,F7,F7,F7-2017,k49,F7 k49,F7,2252.3,242.78,160.9,Y,Y,andrea,F,2,ASY,2,0,20.78,74,17.84,15.8,2.04,6,0.796527778,0.365277778,5H4W2W21124W44HW25124W13H3,20,AA,CC,AA,AA,AA,GG,GG,GG,CC,CC,TT,TT,GG,GG,AA,AG,CC,TT,CT,GG,AG,CC,TT,CC,TT,AG,CT,CC,CC,CC
267,58v87528,58v87528-2017,mz-yp,1,,42775,2017040,40,58v87528 2017040,AR,2017,F8-18,F8,UM,UM-2017,k28b,UM k28b,UM,727.25,#N/A,#N/A,#N/A,N,andrea,M,1,ASY,2,0,20.65,74,19.33,17.5,1.83,2,0.802777778,0.3625,2H1H32GHHH1H4HHGHH53H1HD13H4H3H2H,32,AA,CC,AA,AA,AA,AG,GG,GG,CT,CC,TT,CC,GG,GG,AA,AG,CC,TT,CC,GG,GG,CC,TT,CC,CT,GG,CC,CC,CC,
310,58v87317,58v87317-2017,my-Yg,1,03000273BB,42782,2017047,47,58v87317 2017047,C,2017,F6-14,F6,F6,F6-2017,k46A,F6 k46A,F6,4764.7,29.09,27.82,,Y,andrea,M,1,SY,1,0,19.76,75,18.06,16.3,1.76,16,0.907638889,0.393055556,5W44H11H3,7,AA,CC,AA,AA,AC,AG,GG,GG,CC,CC,TT,CT,GG,GG,AA,AG,CC,TT,CC,GG,GG,CC,TT,CC,CC,GG,CC,CC,CC,CC
340,56v90597,56v90597-2017,wC-mp,4,300028909,42786,2017051,51,56v90597 2017051,O,2017,F6-46,F6,F6,F6-2017,k95,F6 k95,F6,4411.17,62.63,4.33,,Y,andrea,F,2,ASY,2,0,19.85,75,17.87,15.8,2.07,5,0.833333333,0.371527778,4HHH5HH3HHH,10,AA,CC,AA,AA,CC,GG,GG,GG,CT,TC,TT,TT,GG,GG,AA,AG,CC,AT,CC,AG,GG,CC,TT,CC,CT,GG,CC,CT,CC,CC
377,57v77620,57v77620-2017,mr-oR,3,0700EE380C,42792,2017057,57,57v77620 2017057,Q,2017,F6-74,F6,F6,F6-2017,k32,F6 k32,F6,4785.11,121.51,57.81,,Y,andrea,F,2,ASY,2,0,18.99,72,16.49,15.1,1.39,1,0.872916667,0.359027778,5W441H52HH35H32434,16,AA,CT,AT,AA,CC,GG,GG,GG,CT,TC,TT,CT,GG,GG,AA,AG,CC,TT,CC,GG,AA,CG,AT,CC,CC,GG,CC,CT,CC,CT
393,58v87569,58v87569-2017,om-R,1,0700EDFEDC,42793,2017058,58,58v87569 2017058,AS,2017,UM-32,UM,UM,UM-2017,k4b,UM k4b,UM,79.99,15.73,13.71,N,N,andrea,F,2,ASY,2,0,20.42,75,17.71,16.4,1.31,16,0.913194444,0.401388889,2H345H3343,9,AA,CC,AA,AG,AA,AA,TG,AG,CC,CC,TT,TT,GG,GG,AA,AG,CC,TT,CC,GG,GG,CC,TT,CC,CC,GG,CC,CT,CC,CT
400,56v87960,56v87960-2017,R-mb,1,0700ED9ACE,42796,2017061,61,56v87960 2017061,D,2017,F4-31,F4,F4,F4-2017,k39,F4 k39,F4,8441.74,30,4.56,N,Y,melissa,F,2,ASY,2,0,19.36,70,16.74,16,0.74,10,0.947916667,0.372916667,5,0,AA,CT,AT,AA,CC,GG,GG,GG,CC,CC,TT,CT,GG,GG,AA,AG,CC,TT,CC,GG,GG,CG,TT,CC,CT,GG,CC,CT,CC,TT
533,56v90597,56v90597-2018,WC-MP,5,300028909,43125,2018025,25,56v90597 2018025,AB,2018,F6-180,F6,F6,F6-2018,k95,F6 k95,F6,4397.81,62.63,4.33,,,peter,F,2,ASY,2,0,19.96,73,17.73,,,,,,,2,AA,CC,AA,AA,CC,GG,GG,GG,CT,TC,TT,TT,GG,GG,AA,AG,CC,AT,CC,AG,GG,CC,TT,CC,CT,GG,CC,CT,CC,CC
556,56v87922,56v87922-2018,C-mw,2,03000388D1,43128,2018028,28,56v87922 2018028,E,2018,F4-50,F4,F4,F4-2018,k53,F4 k53,F4,8519.02,46.49,50.78,N,Y,peter,F,2,ASY,2,0,19.68,73,18.51,16.6,1.91,14,0.871527778,0.375,22233,4,AA,CC,AA,AG,AC,AA,TG,GG,CT,CC,TT,TT,GG,GG,AA,AG,CC,TT,CC,GG,GG,CC,TT,CC,CT,AG,TT,CC,CC,CC
557,60v46288,60v46288-2018,mw-Gw,1,0110174AB4,43128,2018028,28,60v46288 2018028,E,2018,F4-51,F4,F4,F4-2018,k56a,F4 k56a,F4,8142.65,3.24,3.24,N,N,peter,F,2,SY,1,0,17.96,70,15.69,14.6,1.09,16,0.871527778,0.377083333,1W3Wi3HHW25W41HWiD54,14,AA,CC,AT,AA,CC,AG,GG,GG,CC,CC,TT,TT,GG,AG,AA,AG,TC,AT,CC,GG,GG,CC,TT,CC,TT,GG,CC,CC,CC,CT
560,54v58679,54v58679-2018,C-my,2,0300037A5D,43128,2018028,28,54v58679 2018028,E,2018,F4-54,F4,F4,F4-2018,k23,F4 k23,F4,8265.04,97.62,9.29,N,Y,peter,F,2,ASY,2,0,19.54,74,17.88,16.4,1.48,5,0.871527778,0.388888889,15HHD13W25W42W251H3142W1,19,AA,CT,AT,AA,CC,GG,GG,GG,CT,TC,TT,CT,GG,GG,AA,AG,CC,TT,CT,GG,GG,CC,TT,CC,CT,AG,CT,CT,CC,CT
568,58v87648,58v87648-2018,mz-rz,2,,43130,2018030,30,58v87648 2018030,AT,2018,UM-43,UM,UM,UM-2018,k4,UM k4,UM,156.31,89.61,20.58,N,Y,peter,M,1,ASY,2,0,19.83,75,19.46,17.9,1.56,5,0.791666667,0.386805556,W21HW2W41222W2151W13515H15H1,22,AA,CC,AT,AA,CC,GG,GG,GG,CT,TC,TT,TT,GG,GG,AA,AG,CC,TT,CC,GG,AG,CC,AT,CC,CT,GG,CC,CT,CC,CC
569,58v90075,58v90075-2018,my-rp,1,,43130,2018030,30,58v90075 2018030,AT,2018,UM-44,UM,UM,UM-2018,k5,UM k5,UM,74.67,22.38,7.46,N,Y,peter,M,1,SY,1,1,19.85,73,18.41,16.6,1.81,7,0.791666667,0.389583333,33HHGHH4H51H3H3423HHGH2GH43HD1GHH2,33,AA,CC,AT,AA,AC,AG,GG,AG,CC,TC,TT,TT,GG,GG,AA,AG,CC,TT,CC,GG,GG,CC,TT,CC,CC,GG,CT,CT,CC,CC
573,60v46297,60v46297-2018,mb-Gb,1,0110172C82,43130,2018030,30,60v46297 2018030,AT,2018,UM-48,UM,UM,UM-2018,k13a,UM k13a,UM,243.11,21.13,21.13,N,N,peter,F,2,SY,1,0,19.87,70,18.25,16.4,1.85,3,0.791666667,0.380555556,3323HH,5,AA,CT,AT,AA,CC,GG,GG,GG,CC,TC,TT,TT,GG,GG,AA,AG,CC,AT,CT,GG,GG,CC,TT,CC,TT,GG,CC,TT,CC,CT
600,60v46376,60v46376-2018,mo-oz,1,,43132,2018032,32,60v46376 2018032,AU,2018,F8-51,F8,UM,UM-2018,k11,UM k11,UM,55.55,7.86,58.04,N,N,peter,M,1,ASY,2,0,19.7,76,18.73,17.3,1.43,10,0.791666667,0.364583333,1H3H415HH3H13HHW1343H2H,21,AA,CC,AA,AG,AA,AG,TG,GG,TT,CC,TT,TT,AG,AG,AA,AG,CC,TT,CT,GG,GG,CC,TT,CC,CT,GG,CC,CT,CC,CC
613,60v46380,60v46380-2018,mo-gw,1,,43132,2018032,32,60v46380 2018032,AU,2018,UM-53,UM,UM,UM-2018,k16,UM k16,UM,180.87,24.71,6.53,N,N,peter,M,1,SY,1,0,19.67,73,17.93,16.2,1.73,7,0.791666667,0.388888889,31W31W4W22H33,9,AA,CC,AT,AA,AA,AA,GG,AG,CC,CC,TT,TT,GG,GG,AA,AG,TC,AT,CC,GG,GG,CC,TT,CC,CC,GG,CC,TT,CC,CC
624,58v87781,58v87781-2018,mg-Z,2,030001FA4E,43136,2018036,36,58v87781 2018036,AK,2018,F7-74,F7,F7,F7-2018,k13,F7 k13,F7,2180.44,349.19,140.53,Y,Y,,F,2,ASY,2,0,18.98,70,18.69,15.9,2.79,1,0.791666667,0.378472222,54H13141H331311H4H3,18,AA,CC,AA,AA,AC,AG,GG,GG,CC,CC,TT,CT,GG,GG,AA,AG,CC,TT,CC,GG,GG,CC,TT,CC,CC,GG,CC,CC,CC,CC
627,60v26735,60v26735-2018,mb-bZ,1,0700EDDEFB,43136,2018036,36,60v26735 2018036,AK,2018,F7-69,F7,F7,F7-2018,k44,F7 k44,F7,2159.92,160.37,56.47,Y,Y,,F,2,SY,1,0,19.52,72,18.11,16.4,1.71,8,0.791666667,0.39375,1,0,AA,CT,AT,AG,AC,AG,TG,GG,CC,CC,TT,TT,GG,GG,AA,AG,CC,TT,CC,GG,GG,CC,TT,CT,TT,GG,CC,CT,CC,CT
631,58v87528,58v87528-2018,mz-yp,2,,43137,2018037,37,58v87528 2018037,AL,2018,F8-60,F8,UM,UM-2018,k28b,UM k28b,UM,#N/A,#N/A,#N/A,#N/A,Y,andrea,M,1,ASY,2,0,19.98,75,19.75,17.8,1.95,11,0.805555556,0.359027778,5H453HG1HH45HH31HHGH4H3HH154H1H3H5323543234H1H2,46,AA,CC,AA,AA,AA,AG,GG,GG,CT,CC,TT,CC,GG,GG,AA,AG,CC,TT,CC,GG,GG,CC,TT,CC,CT,GG,CC,CC,CC,
633,60v46391,60v46391-2018,mp-Zw,1,0700EE37B1,43137,2018037,37,60v46391 2018037,AL,2018,F7-76,F7,F7,F7-2018,k63,F7 k63,F7,2694.66,9.61,9.61,N,N,peter,F,2,SY,1,0,17.92,71,17.42,15.4,2.02,12,0.805555556,0.363888889,1,0,AA,CC,AA,AA,AC,AG,GG,GG,CC,CC,TT,TT,AG,AG,AA,AG,TC,TT,CC,GG,GG,CC,TT,CC,CC,GG,CC,TT,CC,CC
635,58v87799,58v87799-2018,mz-Y,2,0700EE28B8,43137,2018037,37,58v87799 2018037,AL,2018,UM-58,UM,UM,UM-2018,k22,UM k22,UM,154.14,106.94,10.25,N,Y,peter,F,2,ASY,2,0,19.29,72,17.87,15.9,1.97,15,0.805555556,0.36875,2W341W35W4443W311W333W2W45313W443W311W3,28,AA,CC,AA,AA,CC,GG,GG,GG,CT,TC,TT,CT,GG,GG,AA,AG,CC,TT,CC,GG,AA,CC,AT,CC,CT,GG,CC,CT,CC,CC
641,59v67721,59v67721-2018,mr-oZ,1,0700EDAEA9,43137,2018037,37,59v67721 2018037,AL,2018,F7-80,F7,F7,F7-2018,k65,F7 k65,F7,2821.92,9.38,9.38,N,Y,peter,M,1,SY,1,1,20.04,75,19.83,17.9,1.93,7,0.805555556,0.381944444,G,0,AA,CC,AA,AG,AC,GG,TG,GG,CT,CC,TT,TT,GG,GG,AA,AG,CC,TT,CC,GG,GG,CG,TT,CC,CC,GG,CC,CT,CC,
649,58v87787,58v87787-2018,mg-xC,2,030001BFA8,43138,2018038,38,58v87787 2018038,AM,2018,F7-88,F7,F7,F7-2018,k25,F7 k25,F7,2515.23,104.55,104.55,Y,Y,peter,F,2,ASY,2,0,18.64,69,17.19,15.3,1.89,14,0.795138889,0.378472222,W23HH531HW43H13123H5HH3H1H313H1H,29,AA,CC,AA,AG,AA,AA,TG,GG,CT,CC,TT,TT,GG,GG,AA,AG,CC,TT,CC,GG,GG,CC,TT,CC,CT,GG,CC,CT,CC,CT
659,58v91001,58v91001-2018,pb-yZ,1,0700EE3C3D,43139,2018039,39,58v91001 2018039,F,2018,F4-60,F4,F4,F4-2018,k19,F4 k19,F4,8449.14,155.4,14.21,Y,N,peter,F,2,SY,1,0,19.45,71,18.92,17.1,1.82,9,0.840277778,0.359722222,43H2H13452H51H5H3H22351H253154,29,,,,,,AA,GG,GG,CT,CC,TT,TT,,GG,AA,AG,CC,TT,CC,GG,GG,CC,TT,CC,CT,GG,CC,TT,CC,CT
661,59v67683,59v67683-2018,my-yg,1,,43139,2018039,39,59v67683 2018039,F,2018,F4-62,F4,F4,F4-2018,k10,F4 k10,F4,8260.7,255.35,27.01,Y,Y,peter,M,1,SY,1,1,18.71,71,18.8,16.7,2.1,10,0.840277778,0.364583333,D,0,AA,CC,AA,AA,AA,AG,GG,GG,CC,CC,TT,TT,GG,GG,AA,AG,CC,TT,TT,GG,GG,CC,TT,CC,TT,GG,CC,CT,CC,CT
673,59v66230,59v66230-2018,mr-gw,1,,43139,2018039,39,59v66230 2018039,F,2018,F4-74,F4,F4,F4-2018,k2,F4 k2,F4,8073.19,110.8,56.01,Y,Y,peter,M,1,SY,1,1,19.07,73,17.44,15.7,1.74,1,0.840277778,0.384722222,5W4W251W31H3,8,AA,CC,AT,AA,CC,GG,GG,GG,CT,TC,TT,TT,GG,GG,AA,AG,CC,TT,CT,GG,GG,CC,TT,CT,CT,GG,CT,CT,CC,CC
679,58v91012,58v91012-2018,my-yw,1,,43142,2018042,42,58v91012 2018042,AN,2018,F7-102,F7,F7,F7-2018,k29,F7 k29,F7,2678.02,112.03,64.69,Y,N,peter,M,1,ASY,2,0,19.85,73,19.22,17.3,1.92,15,0.810416667,0.374305556,5H34123243H1HH3H3,16,AA,CT,AT,AA,CC,GG,GG,GG,CT,CC,TT,TT,GG,GG,AA,AG,TC,TT,CC,GG,GG,CC,TT,CC,CC,GG,CT,CT,CC,CT
680,58v91013,58v91013-2018,mz-zw,1,,43142,2018042,42,58v91013 2018042,AN,2018,F7-103,F7,F7,F7-2018,k28,F7 k28,F7,2594.31,98.3,77.53,Y,N,peter,M,1,ASY,2,0,20.14,75,17.82,16.4,1.42,14,0.810416667,0.376388889,5H3,2,AA,CC,AA,AA,CC,GG,GG,GG,CT,TC,TT,TT,GG,GG,AA,AG,CC,AT,CC,GG,AG,CC,AT,CC,CC,GG,CC,TT,CC,CT
714,58v87510,58v87510-2018,GZ-MG,2,300034148,43158,2018058,58,58v87510 2018058,AE,2018,F6-227,F6,F6,F6-2018,k107,F6 k107,F6,,37.29,10.22,,,peter,F,2,ASY,2,0,20.38,74,18.2,,,,,,,1,AA,CC,AA,AA,AC,AG,GG,AG,CC,CC,TT,TT,GG,,AA,AG,CC,AT,CC,GG,GG,CC,TT,CC,TT,GG,CC,TT,CC,CC
738,58v87569,58v87569-2018,om-xR,2,0700EDFEDC,43161,2018061,61,58v87569 2018061,AV,2018,UM-67,UM,UM,UM-2018,k4,UM k4,UM,156.31,89.61,20.58,N,Y,peter,F,2,ASY,2,0,20.43,74,19.42,16.7,2.72,5,0.865972222,0.388888889,3,0,AA,CC,AA,AG,AA,AA,TG,AG,CC,CC,TT,TT,GG,GG,AA,AG,CC,TT,CC,GG,GG,CC,TT,CC,CC,GG,CC,CT,CC,CT
745,58v91048,58v91048-2018,mp-Rz,1,0700EDD98A,43163,2018063,63,58v91048 2018063,AO,2018,F7-114,F7,F7,F7-2018,k54b,F7 k54b,F7,2626.54,207.14,120.06,Y,N,peter,F,2,SY,1,0,19.11,70,16.93,15.2,1.73,1,0.8375,0.382638889,4,0,AA,CC,AA,AA,AC,AG,GG,GG,CC,CC,TT,TT,GG,GG,AA,AG,CC,TT,CC,GG,GG,CC,TT,CC,CT,GG,CC,CT,CC,CC
790,60v46391,60v46391-2019,mp-Zw,2,0700EE37B1,43493,2019028,28,60v46391 2019028,2019A,2019,F7-135,F7,F7,F7-2019,k29,F7 k29,F7,2678.02,112.03,64.69,Y,Y,andrea,F,2,ASY,2,0,17.89,73,17.27,15,2.27,12,0.788194444,0.369444444,W4,0,AA,CC,AA,AA,AC,AG,GG,GG,CC,CC,TT,TT,AG,AG,AA,AG,TC,TT,CC,GG,GG,CC,TT,CC,CC,GG,CC,TT,CC,CC
794,59v67707,59v67707-2019,mg-pp,1,,43493,2019028,28,59v67707 2019028,2019A,2019,F7-139,F7,F7,F7-2019,k55,F7 k55,F7,2429.98,244.2,244.2,Y,Y,andrea,M,2,ASY,2,0,19.69,77,19.35,17.5,1.85,16,0.788194444,0.377777778,33W4W433532,8,AA,CC,AA,AA,AC,AG,GG,GG,CT,TC,TT,CT,GG,GG,AA,AG,CC,TT,CC,GG,AG,CG,TT,CC,CT,GG,CC,CT,CC,
797,61v22153,61v22153-2019,mw-gw,1,,43496,2019031,31,61v22153 2019031,2019B,2019,F7-142,F7,F7,F7-2019,k61,F7 k61,F7,2512.46,28.68,28.68,Y,Y,melissa,M,1,SY,1,1,20.41,72,19.54,17.4,2.14,5,0.803472222,0.3875,22,1,AA,CC,AA,AA,AA,GG,GG,GG,CC,CC,TT,TT,GG,GG,AA,AG,CC,TT,CC,GG,AG,CC,TT,CC,TT,GG,CT,CC,CC,CC
825,60v45634,60v45634-2019,mb-og,1,,43500,2019035,35,60v45634 2019035,2019C,2019,F4-83,F4,F4,F4-2019,k31,F4 k31,F4,8297.11,221.27,12.67,N,N,andrea,M,1,ASY,2,0,20.23,75,19.55,17.3,2.25,5,0.791666667,0.384027778,W31H3HH4HHHH53H1H23H4HH5HH32HH35H431HH4H313,41,AA,CC,AA,AG,AC,AG,TG,GG,CT,CC,TT,TT,GG,GG,AA,AG,CC,TT,CT,GG,GG,CC,TT,CC,CC,GG,CC,CT,CC,CC
827,58v90075,58v90075-2019,my-rp,2,,43501,2019036,36,58v90075 2019036,2019D,2019,UM-68,UM,UM,UM-2019,k5,UM k5,UM,74.67,22.38,7.46,N,,melissa,M,1,ASY,2,1,20.32,75,18.4,17,1.4,9,0.786805556,0.357638889,3GH3H454H1G13254H314233HH51H5,28,AA,CC,AT,AA,AC,AG,GG,AG,CC,TC,TT,TT,GG,GG,AA,AG,CC,TT,CC,GG,GG,CC,TT,CC,CC,GG,CT,CT,CC,CC
880,60v45665,60v45665-2019,mw-or,1,,43507,2019042,42,60v45665 2019042,2019G,2019,UM-89,F8,UM,UM-2019,k1,UM k1,UM,263.47,30.89,60.43,N,,andrea,M,1,ASY,2,0,19.13,78,18.4,16.7,1.7,15,0.794444444,0.370138889,1,0,AA,CC,AA,AA,CC,AG,GG,GG,CT,CC,TC,TT,GG,GG,AA,AG,CC,TT,CC,GG,GG,CC,TT,CC,TT,GG,CC,TT,CC,CC
881,60v45666,60v45666-2019,mw-Gp,1,011016E8CB,43507,2019042,42,60v45666 2019042,2019G,2019,UM-90,F8,UM,UM-2019,k2,UM k2,UM,252.56,46.73,39.39,N,,melissa,F,2,SY,1,0,19.17,71,17.18,15.7,1.48,14,0.794444444,0.372916667,13W3131H4HW2H531W123HH4H31HGH3H,27,AA,CC,AA,AA,AC,AG,GG,AG,CT,CC,TT,TT,GG,GG,AA,AG,TC,AT,CC,GG,GG,CC,TT,CC,TT,GG,CC,TT,CC,
887,60v46380,60v46380-2019,mo-gw,2,,43507,2019042,42,60v46380 2019042,2019G,2019,UM-96,UM,UM,UM-2019,k16,UM k16,UM,180.87,24.71,6.53,N,,melissa,M,1,ASY,2,0,19.64,77,17.85,16.4,1.45,2,0.794444444,0.382638889,1HW3W22H432324HH23,15,AA,CC,AT,AA,AA,AA,GG,AG,CC,CC,TT,TT,GG,GG,AA,AG,TC,AT,CC,GG,GG,CC,TT,CC,CC,GG,CC,TT,CC,CC
903,60v46376,60v46376-2019,mo-oz,2,,43508,2019043,43,60v46376 2019043,2019H,2019,UM-112,F8,UM,UM-2019,k10a,UM k10a,UM,#N/A,#N/A,#N/A,N,,melissa,M,1,ASY,2,0,19.87,76,18.64,17,1.64,2,0.792361111,0.384027778,W22HHHH1H3HH321H3H32HH3H4HH52,27,AA,CC,AA,AG,AA,AG,TG,GG,TT,CC,TT,TT,AG,AG,AA,AG,CC,TT,CT,GG,GG,CC,TT,CC,CT,GG,CC,CT,CC,CC
908,61v20136,61v20136-2019,my-Gw,1,011016B287,43509,2019044,44,61v20136 2019044,2019I,2019,F5-87,F5,F5,F5-2019,k29,F5 k29,F5,6312.36,75.3,10.22,N,,melissa,F,2,SY,1,1,19.9,71,17.64,15.8,1.84,11,0.804861111,0.375,5,0,AA,CC,AA,AA,CC,GG,GG,GG,CT,CC,TT,TT,GG,GG,AA,AG,CC,AT,CC,GG,GG,CC,TT,CC,CT,GG,CC,TT,CC,CT
916,58v87792,58v87792-2019,my-gy,2,,43510,2019045,45,58v87792 2019045,2019J,2019,UM-116,UM,UM,UM-2019,k27,UM k27,UM,137.95,84.05,19.47,N,,andrea,M,1,ASY,2,0,19.6,76,18.95,17.2,1.75,6,0.820138889,0.386111111,3HH,2,AA,CT,AA,AA,AC,AG,GG,AG,CC,CC,TT,CT,GG,GG,AA,AG,CC,TT,CC,GG,GG,CG,TT,CC,CC,GG,CC,CT,CC,CC
920,60v26735,60v26735-2019,mb-bZ,2,0700EDDEFB,43510,2019045,45,60v26735 2019045,2019J,2019,F7-157,F7,F7,F7-2019,k44,F7 k44,F7,2159.92,160.37,56.47,Y,,andrea,F,2,ASY,2,0,19.7,75,17.17,15.7,1.47,2,0.820138889,0.376388889,3H,1,AA,CT,AT,AG,AC,AG,TG,GG,CC,CC,TT,TT,GG,GG,AA,AG,CC,TT,CC,GG,GG,CC,TT,CT,TT,GG,CC,CT,CC,CT
935,60v45688,60v45688-2019,mo-bz,1,,43515,2019050,50,60v45688 2019050,2019K,2019,F4-116,F4,F4,F4-2019,k58,F4 k58,F4,7997.45,#N/A,#N/A,N,,melissa,M,1,SY,1,0,20.99,75,18.24,16.7,1.54,12,0.8125,0.3625,2,0,AA,CC,AT,AA,CC,GG,GG,GG,CT,TC,TT,TT,GG,GG,AA,AG,TC,AT,CC,GG,GG,CC,TT,CC,CC,GG,CC,TT,CC,
944,61v20213,61v20213-2019,mo-yr,1,,43515,2019050,50,61v20213 2019050,2019K,2019,F4-125,F4,F4,F4-2019,k39,F4 k39,F4,8441.74,30,4.56,N,,andrea,M,1,SY,1,1,20.51,78,18.79,16.9,1.89,2,0.8125,0.375,GHH4GHHHHHHHHHHHHHHHHHHHHHHHHHHHHHH,34,AA,CC,AA,AA,CC,GG,GG,GG,CT,CC,TT,TT,AG,GG,AA,AG,TC,AT,CT,GG,GG,CG,TT,CC,CT,AG,CT,CT,CC,CT
40,56v87587,56v87587-2015,MO-BC,1,030001D745,42326,2015322,-43,56v87587 2015322,,2015,,F6,F6,F6-2015,k68F,F6 k68F,F6,#N/A,#N/A,#N/A,,,peter,F,2,ASY,2,0,19.99,71,17.53,,,,,,,24,AA,CT,AT,AA,CC,GG,GG,GG,CC,TT,TT,TT,GG,,AA,GG,CC,TT,CC,AG,AG,CC,AT,CC,CT,GG,CT,CT,TT,TT
47,58v89041,58v89041-2016,MB-YC,1,030001B84C,42383,2016014,14,58v89041 2016014,,2016,,F6,F6,F6-2016,k50,F6 k50,F6,,0,0,,,peter,F,2,SY,1,0,19.32,72,16.85,,,,,,,5,AA,CC,AA,AA,AC,AG,GG,GG,CC,CC,TT,CT,AG,AG,AA,GG,CC,TT,CC,GG,GG,CC,TT,CC,CT,GG,CT,TT,CC,CT
57,58v89058,58v89058-2016,MW-YW,1,030001C640,42416,2016047,47,58v89058 2016047,,2016,,F6,F6,F6-2016,k119,F6 k119,F6,,#N/A,#N/A,,,peter,F,2,SY,1,0,19.31,70,17.2,,,,,,,29,AA,CC,AA,AA,CC,GG,GG,GG,CC,TC,TT,TT,AG,AG,AC,GG,TC,AT,CC,GG,GG,CC,TT,CT,CT,GG,CC,TT,CC,CT
65,56v87587,56v87587-2016,MO-BC,2,030001D745,42697,2016328,-37,56v87587 2016328,,2016,,F6,F6,F6-2016,rec7,F6 rec7,F6rec,4074.53,80.84,0,,,peter,F,2,ASY,2,0,19.99,70,17.43,,,,,,,18,AA,CT,AT,AA,CC,GG,GG,GG,CC,TT,TT,TT,GG,,AA,GG,CC,TT,CC,AG,AG,CC,AT,CC,CT,GG,CT,CT,TT,TT