N.,Case.No.,Code,Patient.Number,Patient.ID,Dt.Changed,Nm.Change,DATETIME,Date.Ntx.Impl,S3,deltatime,CAObs'n,Mean.CA.End,dd0,dd1,dd2,dd2.,OpTime,Nalt+CleanTime,NaltTime,ddCl,COTi,CNTi,COTi2,CNTi2,CNTi3,CNTi4,CCTi2,RA/CA,CA,RA,PrevCA,PrevRA,deltaRA,deltaCA,Sex,Ht,Wt,BMI,H Dose,H Dura'n,HDDn,Cigs/d,Operator Index,CA,RA,logCA,logRA,RA-CA,asinhRA-CA,RA/CA,logRA/CA,C_AI,C_AP,C_AP_HR75,C_AGPH,C_AGPH_HR75,C_PH,C_T1R,C_AL,C_ATI,PPAmpRatio,P_MAX_DPDT,P_AI,SP,DP,C_SP,C_DP,C_MPS,C_MPD,C_MEANP,C_ESP,HR,ED,C_SVI,C_TTI,C_DTI,C_DD,WCC,Neut,Lymph,Mono,Ptt,ESR,CRP,Gluc,Creat,ALT,AST,Calc,Glob,Chol,Trig,LDL,HDL,Hep B Core Ab,Hep C
1,1,Opiate,36,36,0,1,04/05/2006,20/01/2007,Opiate,0,48.3,48.3,0,-259,-260,-259,0,0,0,0,NA,NA,0,0,0,0,0,1.3938,48.3,67,NA,NA,NA,NA,MALE,177,112,35.75,0.25,7,1.75,0,86,48.3,67,3.8764,4.2084,19.0000,3.6383,1.3938,0.3320,119,6,11,16,25,40,144,9,72,149,827,75,130,71,114,74,102,84,92,101,95,288,99,2786,2761,347,8.2,4.8,2.4,0.9,415,11,10.2,4.9,54,28,25,2.38,45,4.6,2.3,2.15,0.73,Negative ,Positive 
2,1,Ntx,36,36,0,0,21/02/2007,20/01/2007,Ntx,293,49.1,49.5014,293,34,33,34,259,34,34,0,259,34,259,34,34,34,0,1.1919,49.1,59,48.3,67,-8,0.8,MALE,177,110,35.11,0.5,8,4,10,82,49.1,59,3.8935,4.0690,9.4167,2.9384,1.1919,0.1755,119,5,8,16,25,29,145,8,44,150,612,78,111,67,98,69,90,77,83,89,94,283,110,2374,2590,361,8.2,4.8,2.4,0.9,415,11,10.2,4.9,54,28,25,2.38,45,4.6,2.3,2.15,0.73,Negative ,Positive 
3,2,Opiate,1575,1575,0,1,26/02/2009,01/09/2011,Opiate,0,27.4,27.4,0,-915,-916,-915,0,0,0,0,NA,NA,0,0,0,0,0,0.7295,27.4,20,NA,NA,NA,NA,MALE,181,82,25.03,0.5,9,4.5,20,89,27.4,20,3.3112,2.9957,-7.4167,-2.7014,0.7295,-0.3154,91,-3,-7,-9,-19,34,146,,,177,1045,33,118,58,93,59,85,69,73,78,55,327,192,1505,2892,773,6.7,3.6,2.5,0.4,227,8,5,4.9,84,24,24,2.38,32,4.7,1,3.37,0.64,Negative ,Negative 
4,2,Opiate,1575,1575,0,0,21/03/2011,01/09/2011,Opiate,753,29.5,30.5315,753,-162,-163,-162,753,0,0,0,753,0,753,0,0,0,0,0.678,29.5,20,27.4,20,0,2.1,MALE,181,82,25.03,0.5,11,5.5,20,92,29.5,20,3.3844,2.9957,-9.5000,-2.9472,0.6780,-0.3887,86,-4,-6,-14,-20,29,147,,,177,883,21,114,63,92,63,84,71,75,77,62,289,198,1506,2978,674,6.7,3.6,2.5,0.4,227,8,5,4.9,84,24,24,2.38,32,4.7,1,3.37,0.64,Negative ,Negative 
5,2,Opiate,1575,1575,0,0,15/08/2011,01/09/2011,Opiate,147,29.8,30.0014,900,-15,-16,-15,147,0,0,0,900,0,900,0,0,0,0,0.6704,29.8,20,29.5,20,0,0.3,MALE,181,82,25.03,0.5,11,5.5,20,87,29.8,20,3.3956,2.9957,-9.8333,-2.9815,0.6704,-0.3999,94,-2,-5,-6,-13,36,145,,,176,1089,36,128,65,101,65,93,76,81,87,60,305,186,1706,3171,695,6.7,3.6,2.5,0.4,227,8,5,4.9,84,24,24,2.38,32,4.7,1,3.37,0.64,Negative ,Negative 
6,2,Opiate,1575,1575,0,0,13/09/2011,01/09/2011,Opiate,29,29.9,29.9397,929,14,13,14,17,12,12,0,917,12,917,12,12,12,0,0.6685,29.9,20,29.8,20,0,0.1,MALE,181,82,25.03,0.5,11,5.5,20,88,29.9,20,3.3984,2.9957,-9.9167,-2.9899,0.6685,-0.4027,94,-2,-4,-6,-12,32,142,5,32,176,1016,31,116,59,92,59,84,70,74,77,63,302,178,1598,2833,647,6.7,3.6,2.5,0.4,227,8,5,4.9,84,24,24,2.38,32,4.7,1,3.37,0.64,Negative ,Negative 
7,2,Ntx,1723,1723,0,0,15/04/2012,01/09/2011,Clean,215,30.5,30.7945,1144,229,228,229,0,215,135,80,917,227,917,227,134,134,80,0.6557,30.5,20,29.9,20,0,0.6,MALE,181,82,25.03,0.5,11,5.5,20,86,30.5,20,3.4177,2.9957,-10.5000,-3.0468,0.6557,-0.4220,86,-4,-5,-14,-19,29,140,,,179,952,28,117,66,95,66,87,74,78,81,66,297,180,1684,3022,624,6.7,3.6,2.5,0.4,227,8,5,4.9,84,24,24,2.38,32,4.7,1,3.37,0.64,Negative ,Negative 
8,2,Ntx,1723,1723,0,0,10/12/2012,01/09/2011,Clean,240,31.2,31.495,1384,469,468,468,0,455,135,320,917,467,917,467,134,134,400,0.64171123,31.2,20,31,20,0,1,MALE,181,90,27.47,0.5,11,5.5,20,87,31.2,20,3.4393,2.9957,-11.0000,-3.1081,0.6417,-0.4436,94,-2,-3,-6,-11,28,141,,,178,917,35,117,67,96,68,89,77,81,84,65,301,179,1744,3111,624,6.7,3.6,2.5,0.4,227,8,5,4.9,84,24,24,2.38,32,4.7,1,3.37,0.64,Negative ,Negative 
9,3,Opiate,330,330,0,1,25/05/2006,05/03/2008,Opiate,0,30.3,30.3,0,-648,-649,-648,0,0,0,0,NA,NA,0,0,0,0,0,1.0055,30.3,31,NA,NA,NA,NA,MALE,178,65,20.52,0.25,10,2.5,1,93,30.3,31,3.4122,3.4177,0.1667,0.1659,1.0055,0.0055,110,3,0,8,-1,37,149,11,67,156,897,49,121,63,101,64,92,74,80,88,59,332,166,1801,2996,688,6.5,5,1.1,0.3,254,14,0.7,6,68,45,33,2.62,39,6.7,0.8,3.98,1.6,Negative ,Positive 
10,3,Ntx,330,330,0,0,11/03/2008,05/03/2008,Ntx,656,32.1,32.9986,656,8,7,8,650,6,6,0,650,6,650,6,6,6,0,0.7481,32.1,24,30.3,31,-7,1.8,MALE,173,69,23.05,0.25,12,3,1,99,32.1,24,3.4683,3.1781,-8.0833,-2.7868,0.7481,-0.2903,112,4,0,11,0,38,170,6,30,153,903,59,116,58,97,59,88,71,76,87,53,339,189,1580,2991,799,6.5,5,1.1,0.3,254,14,0.7,6,68,45,33,2.62,39,6.7,0.8,3.98,1.6,Negative ,Positive 
11,4,Opiate,1106,1106,0,1,08/01/2008,17/03/2010,Opiate,0,26,26,0,-798,-798,-798,0,0,0,0,NA,NA,0,0,0,0,0,0.7885,26,21,NA,NA,NA,NA,MALE,172,88,29.75,0.5,10,5,10,94,26,21,3.2581,3.0204,-5.5000,-2.4061,0.7885,-0.2377,105,2,-1,4,-4,31,152,3,13,170,906,55,123,70,102,71,96,82,86,94,58,331,183,1824,3341,712,10.8,3.8,5.1,0.3,210,22,2.5,8.6,90,360,104,2.42,31,5.6,2.2,3.18,1.23,,Positive 
12,4,Opiate,1106,1106,0,0,14/03/2010,17/03/2010,Opiate,796,28.3,29.3904,796,-2,-2,-2,796,0,0,0,796,0,796,0,0,0,0,0.708,28.3,20,26,21,-1,2.3,MALE,172,85,28.73,0.5,12,6,10,91,28.3,20,3.3411,2.9957,-8.2500,-2.8070,0.7080,-0.3454,84,-5,-4,-16,-12,31,156,,,181,952,30,127,71,104,72,95,82,87,89,84,295,124,2345,2894,426,10.8,3.8,5.1,0.3,210,22,2.5,8.6,90,360,104,2.42,31,5.6,2.2,3.18,1.23,,Positive 
13,4,Ntx,1106,1106,0,0,03/05/2010,17/03/2010,Ntx,50,28.3,28.3685,846,46,48,46,3,47,47,0,799,47,799,47,47,47,0,0.7059,28.3,20,28.3,20,0,0,MALE,172,85,28.73,0.5,12,6,10,76,28.3,20,3.3440,2.9957,-8.3333,-2.8170,0.7059,-0.3483,93,-2,-2,-7,-9,26,162,,,175,731,40,114,69,96,70,90,78,83,86,70,333,134,2116,2844,519,10.8,3.8,5.1,0.3,210,22,2.5,8.6,90,360,104,2.42,31,5.6,2.2,3.18,1.23,,Positive 
14,4,Opiate,1106,1106,0,0,22/04/2012,17/03/2010,Opiate,720,30.3,31.2863,1566,769,768,769,30,690,135,555,829,737,829,737,737,135,555,0.6593,30.3,20,28.3,20,0,2,MALE,172,88,29.75,0.5,14,7,10,96,30.3,20,2.9957,1.0972,-10.3333,-3.0309,0.6593,-0.4165,83,-6,-5,-17,-16,35,158,,,177,1003,26,127,66,102,67,92,78,83,85,77,293,140,2070,2902,487,10.8,3.8,5.1,0.3,210,22,2.5,8.6,90,360,104,2.42,31,5.6,2.2,3.18,1.23,,Positive 
15,4,Ntx,1650,1650,0,0,21/12/2012,17/03/2010,Clean,244,31,31.3336,1810,1013,1012,1013,0,244,0,244,829,981,829,981,981,135,799,1.156682028,31,36,30.3,20,-16,1,MALE,172,88,29.75,0.5,14,7,10,92,31,36,3.4340,3.5795,4.8600,2.2840,1.1567,0.1456,100,0,3,0,9,32,147,3,21,183,950,47,140,81,116,84,110,95,102,105,94,296,101,3031,3065,345,10.8,3.8,5.1,0.3,210,22,2.5,8.6,90,360,104,2.42,31,5.6,2.2,3.18,1.23,,Positive 
16,5,Opiate,1394,1394,0,1,27/07/2008,24/09/2010,Opiate,0,30.6,30.6,0,-787,-788,-787,0,0,0,0,NA,NA,0,0,0,0,0,0.6812,30.6,21,NA,NA,NA,NA,FEMALE,167,80,28.69,0.25,3,0.75,0,92,30.6,21,3.4205,3.0366,-9.7500,-2.9730,0.6812,-0.3839,108,2,1,7,2,30,139,2,11,169,946,57,115,65,96,66,89,75,80,86,65,338,145,1968,2841,583,8.8,5.5,2.6,0.5,261,19,3.1,5.1,76,22,28,2.59,36,6.4,1.4,4.18,1.66,Negative ,Negative 
17,5,Opiate,1394,1394,0,0,18/02/2009,24/09/2010,Opiate,206,31.1,31.3822,206,-582,-582,-582,206,0,0,0,206,0,206,0,0,0,0,0.6702,31.1,21,30.6,21,0,0.5,FEMALE,167,80,28.69,0.25,4,1,0,89,31.1,21,3.4367,3.0366,-10.2500,-3.0228,0.6702,-0.4001,122,5,3,18,10,27,145,8,36,147,690,68,103,63,91,64,84,73,77,83,60,352,162,1770,2858,659,8.8,5.5,2.6,0.5,261,19,3.1,5.1,76,22,28,2.59,36,6.4,1.4,4.18,1.66,Negative ,Negative 
18,5,Opiate,1394,1394,0,0,22/09/2010,24/09/2010,Opiate,581,32.7,33.4959,787,-1,-1,-1,581,0,0,0,787,0,787,0,0,0,0,0.7883,32.7,26,31.1,21,5,1.6,FEMALE,167,80,28.69,0.25,5,1.25,0,84,32.7,26,3.4864,3.2484,-6.9167,-2.6323,0.7883,-0.2379,124,6,4,19,13,32,142,10,48,146,844,70,118,71,104,72,97,82,87,94,61,346,158,2024,3195,641,5.8,3.5,1.9,0.4,221,22,4.9,4.3,74,19,29,2.57,29,5.3,0.9,4.18,1.66,Negative ,Negative 
19,5,Ntx,1668,1668,0,0,30/09/2010,24/09/2010,Ntx,8,32.8,32.811,795,8,7,8,2,6,6,0,789,6,789,6,6,6,0,0.7328,32.8,24,32.7,26,-2,0.1,FEMALE,167,80,28.69,0.25,5,1.25,0,80,32.8,24,3.4889,3.1781,-8.7500,-2.8655,0.7328,-0.3108,112,3,2,11,8,24,146,5,23,160,663,59,116,77,102,78,97,85,89,93,68,346,136,2276,3086,534,5.8,3.5,1.9,0.4,221,22,4.9,4.3,74,19,29,2.57,29,5.3,0.9,4.18,1.66,Negative ,Negative 
20,5,Ntx,1668,1668,0,0,26/01/2011,24/09/2010,Ntx,118,33.1,33.2616,913,126,125,126,0,118,118,0,789,124,789,124,124,124,0,0.6045,33.1,20,32.8,24,-4,0.3,FEMALE,167,80,28.69,0.25,6,1.5,0,93,33.1,20,3.4990,2.9957,-13.0833,-3.2659,0.6045,-0.5033,115,4,2,13,6,32,146,7,41,154,841,62,112,62,96,63,88,73,78,85,60,361,144,1927,2777,634,5.8,3.5,1.9,0.4,221,22,4.9,4.3,74,19,29,2.57,29,5.3,0.9,4.18,1.66,Negative ,Negative 
21,5,Ntx,1668,1668,0,0,09/03/2011,24/09/2010,Clean,42,33.3,33.3575,955,167,167,167,0,167,135,32,789,166,789,166,134,134,32,0.6015,33.3,20,33.1,20,0,0.2,FEMALE,167,80,28.69,0.25,6,1.5,0,86,33.3,20,3.5041,2.9957,-13.2500,-3.2786,0.6015,-0.5083,115,4,2,13,8,27,147,7,34,154,681,61,107,65,93,66,87,74,79,84,64,347,146,1930,2812,591,5.8,3.5,1.9,0.4,221,22,4.9,4.3,74,19,29,2.57,29,5.3,0.9,4.18,1.66,Negative ,Negative 
22,5,Ntx,1668,1668,0,0,10/12/2012,24/09/2010,Clean,643,35,35.8804,1598,810,810,810,0,643,135,508,789,809,789,809,134,134,540,0.72244898,35,25,33.3,20,5,1.7,FEMALE,167,80,28.69,0.25,6,1.5,0,91,35,25,3.5553,3.2302,-10.0000,-2.9694,0.7224,-0.3251,128,7,4,22,14,32,151,14,71,132,605,73,107,65,98,66,90,76,81,88,59,374,145,1980,2860,642,5.8,3.5,1.9,0.4,221,22,4.9,4.3,74,19,29,2.57,29,5.3,0.9,4.18,1.66,Negative ,Negative 
23,6,Opiate,345,345,1,1,28/05/2006,02/06/2006,Opiate,0,31.6,31.6,0,-4,-4,-4,0,0,0,0,NA,NA,0,0,0,0,0,0.7599,31.6,24,NA,NA,NA,NA,MALE,176,74,23.89,0.25,16,4,8,87,31.6,24,3.4526,3.1781,-7.5833,-2.7234,0.7599,-0.2746,114,4,0,12,1,35,147,3,13,157,958,63,129,74,110,75,101,86,90,100,52,323,216,1707,3687,825,9.2,4.3,3.6,1,270,1,5,4,94,14,19,2.35,26,4,1.3,4.18,1.66,,
24,6,Opiate,345,345,1,0,16/01/2008,16/07/2008,Opiate,598,33.3,34.1192,598,594,-181,-179,128,470,135,335,128,470,128,470,470,135,335,1.2932,33.3,43,31.6,24,19,1.7,MALE,176,74,23.89,0.25,18,4.5,8,82,33.3,43,3.5041,3.7612,9.7500,2.9730,1.2932,0.2571,121,6,4,18,12,36,144,8,43,147,886,66,119,66,104,68,95,81,85,96,64,307,176,1860,3276,633,11.2,7.2,2.7,1.1,257,5,1.1,5.5,76,62,34,2.37,28,3.5,0.8,1.14,1.57,Negative ,Positive 
25,6,Opiate,345,345,1,0,15/03/2009,16/07/2008,Opiate,424,34.4,34.9808,1022,1018,243,244,212,212,135,77,340,682,340,682,682,270,412,1.3714,34.4,47,33.9,60,-13,0.5,MALE,176,74,23.89,0.25,19,4.75,8,81,34.4,47,3.5385,3.8544,12.7833,3.2428,1.3714,0.3159,121,6,5,17,15,36,154,8,50,144,730,69,120,69,106,71,97,83,88,97,70,314,146,2142,3127,538,11.9,6.9,3.3,1.3,283,5,3.7,4.3,76,124,80,2.43,28,3.5,1.8,1.68,1.18,Negative ,Positive 
26,6,Ntx,345,345,0,0,05/04/2009,18/03/2009,Ntx,21,34.4,34.4288,1043,1039,19,19,3,18,18,0,343,700,343,700,700,288,412,1.1041,34.4,38,34.4,47,-9,0,MALE,176,76,24.54,0.5,19,9.5,50,81,34.4,38,3.5385,3.6376,3.5833,1.9884,1.1041,0.0990,116,4,3,14,13,28,151,8,36,149,631,64,110,69,97,70,91,79,83,90,73,312,143,2055,2934,516,11.9,6.9,3.3,1.3,283,5,3.7,4.3,76,124,80,2.43,28,3.5,1.8,1.68,1.18,Negative ,Positive 
27,6,Opiate,345,345,0,0,18/01/2011,18/03/2009,Opiate,653,36.3,37.1945,1696,1692,672,672,309,344,135,209,652,1044,652,1044,1044,135,621,1.4124,36.3,51,34.4,38,13,1.9,MALE,176,74,23.89,0.25,21,5.25,8,92,36.3,51,3.5904,3.9357,14.9500,3.3990,1.4124,0.3453,128,9,5,22,13,43,149,9,52,134,857,73,122,64,108,65,97,80,85,100,56,322,191,1756,3357,745,8.4,3.8,3,1,275,5,2.8,4.4,76,42,29,2.43,32,3.9,2.5,1.68,1.12,Negative ,Positive 
28,6,Opiate,345,345,0,0,31/01/2011,18/03/2009,Opiate,13,36.3,36.3178,1709,1705,685,685,13,0,0,0,665,1044,665,1044,1044,1044,621,1.4345,36.3,52,36.3,51,1,0,MALE,176,74,23.89,0.25,21,5.25,8,81,36.3,52,3.5904,3.9512,15.7500,3.4510,1.4345,0.3608,131,9,6,24,16,38,148,11,56,133,760,75,125,76,114,77,104,89,94,105,60,325,176,2038,3583,673,8.4,3.8,3,1,275,5,2.8,4.4,76,42,29,2.43,32,3.9,2.5,1.68,2.12,Negative ,Positive 
29,6,Opiate,345,345,0,0,13/03/2011,18/03/2009,Opiate,41,36.4,36.4562,1750,1746,726,727,41,0,0,0,706,1044,706,1044,1044,1044,621,1.73,36.4,63,36.3,52,11,0.1,MALE,176,74,23.89,0.25,21,5.25,8,82,36.4,63,3.5950,4.1431,26.5833,3.9738,1.7300,0.5481,138,11,8,28,21,40,139,13,77,131,917,79,124,73,114,74,103,86,92,103,62,321,172,2034,3482,655,8.4,3.8,3,1,275,5,2.8,4.4,76,42,29,2.43,32,3.9,2.5,1.68,3.12,Negative ,Positive 
30,6,Opiate,345,345,0,0,20/03/2011,18/03/2009,Opiate,7,36.4,36.4096,1757,1753,733,734,7,0,0,0,713,1044,713,1044,1044,1044,621,1.7355,36.4,63,36.4,63,0,0,MALE,176,74,23.89,0.25,21,5.25,8,83,36.4,63,3.5950,4.1463,26.7833,3.9813,1.7355,0.5513,123,8,9,18,20,44,141,10,72,145,981,69,132,69,115,71,104,86,93,104,77,311,126,2483,3100,475,8.4,3.8,3,1,275,5,2.8,4.4,76,42,29,2.43,32,3.9,2.5,1.68,4.12,Negative ,Positive 
31,6,Opiate,345,345,0,0,01/02/2012,18/03/2009,Opiate,318,37.3,37.7356,2075,2071,1051,1051,318,0,0,0,1031,1044,1031,1044,1044,1044,621,0.7678,37.3,29,36.4,63,-34,0.9,MALE,176,76,24.54,0.5,22,11,8,82,37.3,29,3.6177,3.3534,-8.6500,-2.8540,0.7678,-0.2642,105,1,2,5,4,32,144,1,8,170,872,52,124,70,103,71,96,82,87,95,74,298,146,2136,3078,513,8.4,3.8,3,1,275,5,2.8,4.4,76,42,29,2.43,32,3.9,2.5,1.68,5.12,Negative ,Positive 
32,6,Opiate,345,345,0,0,21/03/2012,18/03/2009,Opiate,49,37.4,37.4671,2124,2120,1100,1100,49,0,0,0,1080,1044,1080,1044,1044,1044,621,1.6882,37.4,63,37.3,29,34,0.1,MALE,176,74,23.89,0.25,22,5.5,8,92,37.4,63,3.6221,4.1458,25.7500,3.9420,1.6882,0.5237,131,11,8,24,19,44,142,12,74,133,888,77,132,74,120,76,108,90,96,110,65,310,168,2150,3604,622,8.4,3.8,3,1,275,5,2.8,4.4,76,42,29,2.43,32,3.9,2.5,1.68,6.12,Negative ,Positive 
33,6,Opiate,345,345,1,0,08/10/2012,18/03/2009,Opiate,201,37.9,38.1925,2325,2321,1300,1300,201,0,0,0,1281.350694,1044,1281,1044,1044,1044,621,1.4,37.9,53,37.4,63,-10,0.5,MALE,176,74,23.89,1.25,22,27.5,8,83,37.9,53,3.6400,3.9700,15.2300,3.4200,1.4000,0.3400,123,8,6,18,15,42,146,9,58,142,923,69,132,72,116,74,105,87,93,97,68,308,157,2180,3420,580,8.4,3.8,3,1,275,5,2.8,4.4,76,42,29,2.43,32,3.9,2.5,1.68,6.12,Negative ,Positive 
34,6,Opiate,345,345,2,0,05/12/2012,11/10/2012,Opiate,58,38.1,38.1628,2383,2379,55,55,3,55,55,0,1284.350694,1099,1284,1099,1099,1099,621,1.67,38.1,64,37.9,53,10,0.2,MALE,176,76,24.54,2.25,22,49.5,8,88,38.1,64,3.6400,4.1500,25.5200,3.9300,1.6700,0.5100,126,8,10,20,23,39,145,9,61,145,810,75,127,71,113,73,102,87,93,95,83,288,130,2427,3139,440,8.4,3.8,3,1,275,5,2.8,4.4,76,42,29,2.43,32,3.9,2.5,1.68,6.12,Negative ,Positive 
35,6,Ntx,345,345,0,0,18/12/2012,11/10/2012,Ntx,13,38.2,38.1845,2393,2391,68,68,0,13,13,0,1284,1112,1284,1112,1112,1112,621,1.375545852,38.2,53,38.1,64,-11,0.1,MALE,176,76,24.54,0.5,16,8,50,92,38.2,53,3.6420,3.9608,14.0000,3.3569,1.3755,0.3189,124,5,6,19,23,28,143,10,51,144,599,72,108,68,98,70,90,79,84,91,81,303,127,2214,2810,440,8.4,3.8,3,1,275,5,2.8,4.4,76,42,29,2.43,32,3.9,2.5,1.68,6.12,Negative ,Positive 
36,6,Ntx,345,345,0,0,20/12/2012,11/10/2012,Ntx,2,38.2,38.2027,2395,2393,70,70,0,2,2,0,1286,1114,1286,1114,1114,1114,621,1.151832461,38.2,44,38.2,53,-9,0,MALE,176,76,24.54,0.5,16,8,50,94,38.2,44,3.6428,3.7842,6.0000,2.4584,1.1518,0.1414,116,5,5,14,14,34,150,7,40,150,726,65,121,71,106,73,98,84,89,97,75,308,138,2246,3084,495,8.4,3.8,3,1,275,5,2.8,4.4,76,42,29,2.43,32,3.9,2.5,1.68,6.12,Negative ,Positive 
37,7,Opiate,1707,1707,0,1,21/03/2011,11/11/2009,Opiate,0,30.8,30.8,0,496,496,497,0,0,0,0,NA,NA,0,0,0,0,0,0.6486,30.8,20,NA,NA,NA,NA,MALE,183,90,26.87,0.25,6,1.5,8,92,30.8,20,3.4286,2.9957,-10.8333,-3.0779,0.6486,-0.4329,83,-6,-3,-17,-7,38,143,,,187,1182,29,140,69,110,72,98,80,88,89,95,274,106,2567,2717,356,9.7,6.3,2.4,0.8,259,8,2.1,6.1,76,15,19,2.21,25,5.6,2.3,4.21,0.82,Negative ,Negative 
38,7,Ntx,1707,1707,1,0,07/04/2011,24/03/2011,Ntx,17,30.9,30.9233,17,513,15,15,3,14,14,0,3,14,3,14,14,14,0,0.6469,30.9,20,30.8,20,0,0.1,MALE,183,90,26.87,0.7,8,5.6,25,91,30.9,20,3.4313,2.9957,-10.9167,-3.0855,0.6469,-0.4356,74,-9,-4,-26,-10,33,146,,,191,1105,21,144,81,118,85,107,92,99,100,106,251,109,2838,3074,315,9.7,6.3,2.4,0.8,259,8,2.1,6.1,76,15,19,2.21,25,5.6,2.3,4.21,0.82,Negative ,Negative 
39,7,Opiate,1707,1707,1,0,21/02/2012,24/03/2011,Opiate,320,31.8,32.2384,337,833,335,834,222,98,98,0,225,112,225,112,112,112,0,0.8583,31.8,27,30.9,20,7,0.9,MALE,183,90,26.87,0.25,8,2,25,96,31.8,27,3.4579,3.3051,-4.5000,-2.2093,0.8583,-0.1528,92,-3,1,-8,2,35,146,,,189,1063,38,134,69,108,73,98,81,89,88,97,297,91,2792,2532,327,13,7.7,3.9,1,309,5,0.7,7.3,79,27,21,2.54,26,6.3,3.7,4.21,0.82,Negative ,Negative 
40,7,Opiate,1707,1707,1,0,15/03/2012,05/04/2012,Opiate,23,31.8,31.8315,360,856,-20,857,23,0,0,0,248,112,248,112,112,112,0,0.6283,31.8,20,31.8,27,-7,0,MALE,183,90,26.87,0.25,8,2,25,91,31.8,20,3.4605,2.9957,-11.8333,-3.1658,0.6283,-0.4648,81,-7,-4,-19,-11,38,147,,,182,1129,29,144,75,115,77,103,85,93,94,90,297,102,2770,2823,364,13,7.7,3.9,1,309,5,0.7,7.3,79,27,21,2.54,26,6.3,3.7,4.21,0.82,Negative ,Negative 
41,8,Opiate,404,404,0,1,01/06/2006,31/10/2006,Opiate,0,45.3,45.3,0,-151,-151,-151,0,0,0,0,NA,NA,0,0,0,0,0,1.3971,45.3,63,NA,NA,NA,NA,FEMALE,174,70,23.12,0.2,23,4.6,10,82,45.3,63,3.8140,4.1484,18.0000,3.5843,1.3971,0.3344,162,11,12,38,40,29,136,17,87,119,500,98,124,89,120,91,111,101,105,113,79,317,125,2799,3497,440,,,,,,,,,,,,,,,,,,,
42,8,Ntx,404,404,0,0,20/12/2006,31/10/2006,Ntx,202,45.9,46.1767,202,52,51,52,152,50,50,0,152,50,152,50,50,50,0,1.5354,45.9,71,45.3,63,8,0.6,FEMALE,174,70,23.12,0.2,23,4.6,10,88,45.9,71,3.8268,4.2556,24.5833,3.8956,1.5354,0.4288,140,11,15,29,36,37,141,16,119,134,670,84,137,87,128,90,116,102,109,116,89,319,97,3309,3200,355,,,,,,,,,,,,,,,,,,,
43,8,Ntx,404,404,0,0,27/02/2007,31/10/2006,Ntx,69,46.1,46.1945,271,120,120,120,0,69,69,0,152,119,152,119,119,119,0,1.3779,46.1,64,45.9,71,-7,0.2,FEMALE,174,70,23.12,0.2,24,4.8,10,94,46.1,64,3.8305,4.1510,17.4167,3.5514,1.3779,0.3206,137,8,11,27,33,31,149,16,92,134,476,83,127,86,119,88,109,97,103,109,88,322,99,3100,3062,359,,,,,,,,,,,,,,,,,,,
44,8,Ntx,404,404,0,0,07/01/2009,31/10/2006,Clean,680,47.9,48.8315,951,801,800,801,0,680,135,545,152,799,152,799,134,134,545,1.607,47.9,77,46.1,64,13,1.8,FEMALE,174,70,23.12,0.2,24,4.8,10,100,47.9,77,3.8695,4.3438,29.0833,4.0636,1.6070,0.4743,131,8,18,24,40,35,137,13,96,143,642,85,125,75,113,78,102,87,95,101,108,288,79,3190,2505,267,,,,,,,,,,,,,,,,,,,
45,9,Opiate,1334,1334,0,1,23/06/2008,10/09/2008,Opiate,0,29.8,29.8,0,-77,-78,-77,0,0,0,0,NA,NA,0,0,0,0,0,0.6704,29.8,20,NA,NA,NA,NA,MALE,182,118,35.62,0.5,12,6,20,91,29.8,20,3.3956,2.9957,-9.8333,-2.9815,0.6704,-0.3999,94,-2,-2,-6,-5,38,180,,,169,913,40,137,73,112,74,103,84,93,93,77,352,99,2790,2770,424,13.3,10.5,2,0.7,291,8,7.7,7.3,81,27,18,2.51,36,3,1.1,1.62,0.93,Negative ,Positive 
46,9,Ntx,1334,1334,0,0,30/09/2008,10/09/2008,Ntx,99,30.1,30.2356,99,22,21,22,79,20,20,0,79,20,79,20,20,20,0,0.7812,30.1,24,29.8,20,4,0.3,MALE,185,108,31.56,1,12,12,10,100,30.1,24,3.4040,3.1570,-6.5833,-2.5834,0.7812,-0.2470,90,-3,-1,-10,-1,32,161,,,182,846,32,133,76,110,79,101,86,92,93,94,287,105,2708,2837,356,13.3,10.5,2,0.7,291,8,7.7,7.3,81,27,18,2.51,36,3,1.1,1.62,0.93,Negative ,Positive 
47,10,Opiate,145,145,1,1,11/05/2006,19/07/2006,Opiate,0,25.9,25.9,0,-68,-68,-683,0,0,0,0,NA,NA,0,0,0,0,0,1.1859,25.9,20,NA,NA,NA,NA,MALE,181,110,33.58,0.5,6,3,0,90,31.2,37,3.4404,3.6109,5.8000,2.4584,1.1859,0.1705,112,4,2,11,7,40,145,5,34,159,1021,58,141,78,119,80,110,91,98,105,67,322,147,2372,3484,570,5.6,1.6,2.9,0.3,219,7,13.9,4.8,40,96,79,2.38,31,4,0.7,2.17,1.16,Negative ,Negative 
48,10,Opiate,1649,1649,0,0,14/02/2010,17/02/2010,Opiate,0,29,29,0,-2,-2,-2,0,0,0,0,NA,NA,0,0,0,0,0,0.9713,29,28,25.9,20,8,3.1,MALE,181,97,29.61,0.5,10,5,20,93,29,28,3.3673,3.3381,-0.8333,-0.7585,0.9713,-0.0292,102,1,1,2,3,34,160,4,26,168,818,50,125,69,104,70,96,79,86,90,78,322,117,2386,2777,454,11.3,8.8,1.9,0.5,290,14,4.1,4.6,75,43,34,2.5,36,6.8,1.5,4.45,1.27,Negative ,Negative 
49,10,Ntx,1649,1649,0,0,22/08/2010,17/02/2010,Clean,189,29.5,29.7589,189,187,187,187,3,186,135,51,3,186,3,186,134,134,52,0.678,29.5,20,29,28,-8,0.5,MALE,181,97,29.61,0.5,10,5,20,80,29.5,20,3.3844,2.9957,-9.5000,-2.9472,0.6780,-0.3887,92,-3,-2,-8,-7,31,152,,,179,940,38,128,72,105,73,96,81,87,88,78,319,117,2414,2822,446,5.6,1.6,2.9,0.3,219,7,13.9,4.8,40,96,79,2.38,31,4,0.7,2.17,1.16,Negative ,Negative 
50,10,Ntx,1649,1649,0,0,19/09/2010,17/02/2010,Clean,28,29.6,29.6384,217,216,215,216,0,28,28,0,3,214,3,214,134,134,132,0.6761,29.6,20,29.5,20,0,0.1,MALE,181,107,32.66,0.5,10,5,20,85,29.6,20,3.3872,2.9957,-9.5833,-2.9559,0.6761,-0.3915,101,0,-1,1,-2,41,162,3,17,168,999,49,136,67,109,68,100,79,87,91,67,344,130,2272,2947,561,5.6,1.6,2.9,0.3,219,7,13.9,4.8,40,96,79,2.38,31,4,0.7,2.17,1.16,Negative ,Negative 
51,10,Opiate,1649,1649,0,0,17/01/2011,17/02/2010,Opiate,120,29.9,30.0644,337,336,335,336,120,0,0,0,123,214,123,214,214,214,132,0.8643,29.9,26,29.6,20,6,0.3,MALE,181,110,33.58,0.5,11,5.5,0,85,29.9,26,3.3984,3.2526,-4.0595,-2.1090,0.8643,-0.1458,101,0,0,1,1,35,154,3,22,168,878,50,128,70,106,71,97,79,86,89,75,321,124,2321,2858,488,5.6,1.6,2.9,0.3,219,7,13.9,4.8,40,96,79,2.38,31,4,0.7,2.17,1.16,Negative ,Negative 
52,10,Opiate,1649,1649,0,0,31/05/2011,17/02/2010,Opiate,134,30.3,30.4836,471,470,469,470,134,0,0,0,257,214,257,214,214,214,132,0.6887,30.3,21,29.9,26,-5,0.4,MALE,181,110,33.58,0.5,11,5.5,0,81,30.3,21,3.4095,3.0366,-9.4167,-2.9384,0.6887,-0.3729,97,-1,-2,-3,-6,35,154,3,15,174,935,43,127,67,103,68,94,76,83,87,68,331,137,2107,2873,560,5.6,1.6,2.9,0.3,219,7,13.9,4.8,40,96,79,2.38,31,4,0.7,2.17,1.16,Negative ,Negative 
53,10,Opiate,1649,1649,0,0,15/02/2012,17/02/2010,Opiate,260,31,31.3562,731,730,729,730,260,0,0,0,517,214,517,214,214,214,132,0.9785,31,30,30.3,21,9,0.7,MALE,181,110,33.58,0.5,12,6,0,94,31,30,3.4340,3.4122,-0.6667,-0.6251,0.9785,-0.0217,102,1,2,2,4,46,150,4,37,171,1197,49,147,68,116,70,105,82,92,95,79,326,105,2690,2808,440,5.6,1.6,2.9,0.3,219,7,13.9,4.8,40,96,79,2.38,31,4,0.7,2.17,1.16,Negative ,Negative 
54,10,Opiate,1649,1649,0,0,01/03/2012,17/02/2010,Opiate,15,31,31.0205,746,745,744,745,15,0,0,0,532,214,532,214,214,214,132,1.3097,31,41,31,30,11,0,MALE,181,110,33.58,0.5,12,6,0,89,31,41,3.4340,3.7038,9.6000,2.9576,1.3097,0.2698,108,3,4,8,9,40,152,6,47,160,926,57,138,74,116,76,106,86,95,99,79,328,107,2742,2933,434,5.6,1.6,2.9,0.3,219,7,13.9,4.8,40,96,79,2.38,31,4,0.7,2.17,1.16,Negative ,Negative 
55,10,Opiate,1649,1649,0,0,15/03/2012,17/02/2010,Opiate,14,31.1,31.1192,760,759,758,759,14,0,0,0,546,214,546,214,214,214,132,1.1131,31.1,35,31,41,-6,0.1,MALE,181,110,33.58,0.5,12,6,0,89,31.1,35,3.4367,3.5439,3.5167,1.9703,1.1131,0.1072,98,-1,2,-3,7,33,141,2,13,186,1058,46,136,75,111,78,103,87,95,95,94,300,95,2906,2767,338,5.6,1.6,2.9,0.3,219,7,13.9,4.8,40,96,79,2.38,31,4,0.7,2.17,1.16,Negative ,Negative 
56,10,Opiate,1649,1649,0,0,29/03/2012,17/02/2010,Opiate,14,31.1,31.1192,774,773,772,773,14,0,0,0,560,214,560,214,214,214,132,0.9514,31.1,30,31.1,35,-5,0,MALE,181,110,33.58,0.5,12,6,0,89,31.1,30,3.4367,3.3868,-1.5119,-1.2013,0.9514,-0.0499,101,0,1,1,4,37,151,2,17,174,975,50,136,72,111,74,102,84,92,96,81,310,115,2559,2951,435,5.6,1.6,2.9,0.3,219,7,13.9,4.8,40,96,79,2.38,31,4,0.7,2.17,1.16,Negative ,Negative 
57,10,Opiate,1649,1649,0,0,16/04/2012,17/02/2010,Opiate,19,31.2,31.1924,793,792,791,791,19,0,0,0,579,214,19,214,214,214,132,1.174331551,31.2,37,31.1,30,7,0.1,MALE,181,110,33.58,0.5,12,6,0,90,31.2,37,3.4393,3.6000,5.0000,2.3941,1.1743,0.1607,112,4,2,11,7,40,145,5,34,159,1021,58,141,78,119,80,110,91,98,105,67,322,147,2372,3484,570,5.6,1.6,2.9,0.3,219,7,13.9,4.8,40,96,79,2.38,31,4,0.7,2.17,1.16,Negative ,Negative 
58,10,Opiate,1649,1649,0,0,28/05/2012,17/02/2010,Opiate,42,31.3,31.3075,835,834,833,833,42,0,0,0,621,214,42,214,214,214,132,1.466666667,31.3,46,31.2,37,9,0.1,MALE,181,110,33.58,0.5,12,6,0,89,31.3,46,3.4420,3.8250,15.0000,3.3742,1.4667,0.3830,114,5,5,12,11,44,143,7,48,156,1131,61,147,78,124,80,113,92,100,108,72,314,135,2558,3443,521,5.6,1.6,2.9,0.3,219,7,13.9,4.8,40,96,79,2.38,31,4,0.7,2.17,1.16,Negative ,Negative 