Client_no,Theatre_no,mflcode,Service_type,province,Ageindays,A4age,A7age,A9SubCounty,A9County,Infor_source,Bleeding_disorder,Fever,Jaundice,UndescendedTestes,Swellingscrotum,AbnormalPenileAppearance,CongenitalAnomaly,allergies,SiteofDelivery,ModeofDelivery,Pregnancy_Complications,Weight,Length,RespiratoryRate,HeartRate,Temperature,good_health,counseled,consented_assented,Eligible_Age,Eligible_Age_Weight,EligibleforEIMC,ineligible_Explain,IneligibleCode,Start_Time,End_time,Pre_op_medic,Pre_op_medic_Volume,Anaesthesia_type,Anaeesthesia_conc,Anaesthasia_vol,Procedure_Type,AE,AEtype,AErate,Designation,ClinicianCadreID,AssistantCadreID,EIMC_Context,Post_opRespiratoryRate,Post_opHeartRate,Post_opTemperature,Post_op_medic,Post_op_medicother,Paracetamol_Volume,Post_opInstruction,Followed_Up,Visit_type,OtherVisitType,Post_op_AE,AE_type,postopAERate,Age_Days,Model,Duration,MCDuration,FUdays,year,month,MC_year,MC_month
"RASRDH0014414",144,14022,2,"Nyanza",0,21,34,"RACHUONYO SOUTH","HOMA BAY",5,2,2,2,2,2,2," ",0,2,2," ",3,,48,128,40,1,1,1,,1,1," ",,41400.00000000004,42120,"SYR PCM",,1,2,.6,1,2," ",,1,2,,1,58,122,37,1,,2,1,0,," ",," ",,0,2,719.9999999999636,2,,2014,7,2014,7
"RASRDH0042815",428,14022,2,"Nyanza",1,28,34,"RACHUONYO SOUTH","HOMA BAY",5,2,1,2,2,2,2," ",0,2,2," ",4.2,,47,149,39.2,2,1,1,1,1,2,"DIFFERED DUE TO FEVER",4,,," ",,,,,,," ",,,,,,,,,,,,,0,," ",," ",,1,2,,,,2015,3,,
"RANKAN0023916",0,13653,2,"Nyanza",1,27,33,"RACHUONYO NORTH","HOMA BAY",4,1,1,2,2,2,2," ",0,2,2," ",3.5,,52,140,39.2,1,1,1,1,1,2,"BABY HAS FEVER",4,,," ",,,,,,," ",,,,,,,,,,,,,0,," ",," ",,1,1,,,,2016,6,,
"RANKAN0024516",0,13653,2,"Nyanza",5,23,28,"RACHUONYO NORTH","HOMA BAY",4,2,1,2,2,2,2," ",0,2,2," ",3.6,,68,168,39,2,1,1,1,1,2,"DEFFERED DUE TO FEVER",4,,," ",,,,,,," ",,,,,,,,,,,,,0,," ",," ",,5,1,,,,2016,7,,
"RASRDH0084016",827,14022,2,"Nyanza",4,35,44,"RACHUONYO SOUTH","HOMA BAY",4,2,2,2,2,2,2," ",0,2,1," ",2.8,,46,145,38.6,1,1,1,1,1,1," ",,45360.00000000001,46260.00000000003,"Paracetamol Syrup",1.5,1,2,.35,1,2," ",,1,3,3,1,46,145,36.5,0,,,1,1,3," ",2," ",,4,2,900.0000000000218,2,6,2016,4,2016,4
"RASOBR0006914",66,13953,1,"Nyanza",0,23,30,"KASIPUL KABONDO","HOMA BAY",4,2,2,2,2,2,2," ",0,2,2," ",4.2,,54,128,38.5,1,1,1,1,1,1," ",,7199.999999999996,8220.000000000002,"PCM",,1,2,.6,1,2," ",,2,3,,1,50,156,35.4,1,,2,1,1,3," ",2," ",,0,2,1020.000000000006,3,6,2014,12,2014,12
"RASRDH0062115",0,14022,2,"Nyanza",1,28,35,"RACHUONYO SOUTH","HOMA BAY",5,2,1,2,2,2,2," ",0,2,2," ",2.9,,50,150,38.4,2,1,1,1,1,2,"BABY HAS HIGH FEVER. DEFERRED. TCA 22/09/15",4,,," ",,,,,,," ",,,,,,,,,,,,,0,," ",," ",,1,2,,,,2015,9,,
"RASRDH0081616",0,14022,2,"Nyanza",58,21,58,"RACHUONYO SOUTH","HOMA BAY",4,1,2,2,2,2,2," ",0,2,2," ",2.4,,66,164,38.2,2,1,1,1,1,2,"BABY UNDERWEIGHT AND ALSO HAD FEVER",5,,," ",,,,,,," ",,,,,,,,,,,,,0,," ",," ",,59,2,,,,2016,4,,
"RASRDH0038415",384,14022,2,"Nyanza",1,18,32,"RACHUONYO NORTH","HOMA BAY",1,2,1,2,2,2,2," ",0,2,2," ",3.7,,44,148,38.2,2,1,1,1,1,2,"BABY HAS FEVER OF 38.2C",4,,," ",,,,,,," ",,,,,,,,,,,,,0,," ",," ",,1,2,,,,2015,3,,
"RASOBR0020016",0,13953,2,"Nyanza",20,34,44,"RACHUONYO NORTH","HOMA BAY",4,2,1,2,2,2,2," ",0,1,2," ",4.5,,68,160,38.1,2,1,1,1,1,2,"Baby has fever",4,,," ",,,,,,," ",,,,,,,,,,,,,0,," ",," ",,21,2,,,,2016,1,,
"RASRDH0084816",0,14022,2,"Nyanza",3,18,25,"RACHUONYO SOUTH","HOMA BAY",4,2,1,2,2,2,2," ",0,2,2," ",3.5,,48,139,38,1,1,1,1,1,2,"BABY HAS FEVER.",4,,," ",,,,,,," ",,,,,,,,,,,,,0,," ",," ",,3,2,,,,2016,5,,
"RASRDH0013614",136,14022,2,"Nyanza",4,37,49,"RACHUONYO SOUTH","HOMA BAY",5,2,2,2,2,2,1," ",0,2,2," ",3.2,,50,133,38,1,1,1,,1,2,"DEFFERED. MICROPENIS. HYPOSPADIA",3,,," ",,,,,,," ",,,,,,,,,,,,,0,," ",," ",,4,2,,,,2014,7,,
"RASRDH0014014",140,14022,2,"Nyanza",2,27,47,"RACHUONYO SOUTH","HOMA BAY",5,2,2,2,2,2,2," ",0,2,2," ",3.2,,58,123,38,1,1,1,,1,1," ",,49679.99999999999,50279.99999999996,"SYR PCM",,1,2,.45,1,2," ",,1,2,,1,53,119,38,1,,2,1,1,3," ",2," ",,2,2,599.9999999999709,1,4,2014,7,2014,7
"RASKOK0003814",38,13712,2,"Nyanza",3,37,42,"RACHUONYO SOUTH","HOMA BAY",4,2,2,2,2,2,2," ",0,2,2," ",3.2,,37,118,38,1,1,1,,1,1," ",,47880.00000000003,49019.99999999999,"PCM SYR",,1,2,.5,1,2," ",,1,2,,1,36,112,37,1,,2,1,0,," ",," ",,4,2,1139.999999999956,3,,2014,7,2014,7
"RASKOK0010115",0,13712,2,"Nyanza",15,26,35,"RACHUONYO SOUTH","HOMA BAY",5,2,1,2,2,2,2," ",0,2,2," ",3.1,,,,38,2,1,2,1,1,2,"CLIENT IS FEBRILE",4,,," ",,,,,,," ",,,,,,,,,,,,,0,," ",," ",,15,2,,,,2015,7,,
"RASRDH0033515",335,14022,1,"Nyanza",12,33,41,"RACHUONYO SOUTH","HOMA BAY",4,2,2,2,2,2,2," ",0,2,2," ",3.5,,58,148,37.8,2,1,1,1,1,2,"DIFFERED DUE TO GENERALIZED RASHES AND OPHTHALMIA NEONATOUM",6,,," ",,,,,,," ",,,,,,,,,,,,,0,," ",," ",,13,2,,,,2015,2,,
"RASRDH0048715",487,14022,2,"Nyanza",1,34,37,"RACHUONYO SOUTH","HOMA BAY",5,2,2,2,2,2,2," ",0,2,2," ",2.9,,42,140,37.8,1,1,1,1,1,1," ",,41879.99999999998,42600.00000000004,"SYRUP PCM 1.5MLS",,1,2,.35,1,2," ",,2,3,,1,44,141,37.5,0,,0,1,1,3," ",2," ",,1,2,720.0000000000655,2,4,2015,5,2015,5
"RASRDH0030615",306,14022,1,"Nyanza",10,34,40,"RACHUONYO SOUTH","HOMA BAY",4,2,2,2,2,2,2," ",0,2,2," ",3.2,,58,158,37.7,1,1,1,1,1,1," ",,43799.99999999996,44579.99999999999,"PCM SYRUP 1.5",,1,2,.45,1,2," ",,2,3,,1,54,148,37.4,1,,1.5,1,0,," ",," ",,10,2,780.0000000000291,2,,2015,1,2015,1
"RASRDH0042515",425,14022,2,"Nyanza",1,22,38,"RACHUONYO SOUTH","HOMA BAY",4,2,1,2,2,2,2," ",0,2,2," ",3.4,,62,154,37.7,2,1,1,1,1,2,"DEFFERED DUE TO FEVER, RESPIRATORY DISTRESS AND HYOGLYCEMIA",4,,," ",,,,,,," ",,,,,,,,,,,,,0,," ",," ",,1,2,,,,2015,3,,
"RASRDH0032215",322,14022,2,"Nyanza",38,28,35,"RACHUONYO SOUTH","HOMA BAY",4,2,2,2,2,2,2," ",0,2,2," ",4.4,,44,154,37.7,1,1,1,1,1,1," ",,36840.00000000001,37559.99999999998,"PCM 2MLS",,1,2,.6,1,2," ",,1,2,,1,44,152,37.1,1,,2,1,1,3," ",2," ",,38,2,719.9999999999709,2,5,2015,1,2015,1
"RASRDH0034715",347,14022,2,"Nyanza",0,35,55,"RACHUONYO SOUTH","HOMA BAY",5,2,2,2,2,2,2," ",0,2,2," ",3.2,,58,150,37.7,1,1,1,1,1,1," ",,48960.00000000003,49559.99999999999,"SYR PCM 1.5",,1,2,.45,1,2," ",,1,2,,1,54,148,37.6,1,,1.5,1,1,3," ",2," ",,0,2,599.9999999999563,1,5,2015,2,2015,2
"RASRDH0034015",340,14022,2,"Nyanza",1,20,30,"RACHUONYO SOUTH","HOMA BAY",4,2,2,2,2,2,2," ",0,2,2," ",3.2,,58,148,37.7,1,1,1,1,1,1," ",,38280.00000000004,39000.00000000001,"SYR PCM 1.5MLS STAT",,1,2,.45,1,2," ",,1,2,,1,54,150,37.6,1,,1.5,1,1,3," ",2," ",,1,2,719.9999999999709,2,5,2015,2,2015,2
"RASRDH0030915",309,14022,2,"Nyanza",0,34,40,"RACHUONYO SOUTH","HOMA BAY",4,2,2,2,2,2,2," ",0,2,2," ",3.9,,58,148,37.7,1,1,1,1,1,1," ",,41039.99999999999,41700.00000000001,"SYR PCM",,1,2,.5,1,2," ",,2,3,2,1,58,149,37.1,0,,,1,1,3," ",2," ",,0,2,660.0000000000146,2,5,2015,1,2015,1
"RASRDH0027314",273,14022,1,"Nyanza",9,29,34,"RACHUONYO SOUTH","HOMA BAY",5,2,2,2,2,2,2," ",0,2,2," ",3,,54,148,37.7,1,1,1,1,1,1," ",,49800.00000000001,50519.99999999998,"SYRUP PCM 1.5 STAT",,1,2,.45,1,2," ",,2,3,,1,52,148,37.6,1,,1.5,1,0,," ",," ",,9,2,719.9999999999709,2,,2014,12,2014,12
"RASRDH0028514",285,14022,1,"Nyanza",59,37,41,"RACHUONYO SOUTH","HOMA BAY",4,2,2,2,2,2,2," ",0,2,2," ",4.5,,52,148,37.7,1,1,1,1,1,1," ",,47399.99999999999,48000.00000000004,"PCM 2.5",,1,2,.65,1,2," ",,2,3,,1,50,150,37.2,1,,2.5,1,1,3," ",2," ",,59,2,600.0000000000509,1,7,2014,12,2014,12
"RASRDH0033715",337,14022,1,"Nyanza",29,25,30,"RACHUONYO SOUTH","HOMA BAY",4,2,2,2,2,2,2," ",0,2,2," ",4.5,,50,148,37.7,1,1,1,1,1,1," ",,38880,40200.00000000002,"PCM SYRUP 2.5MLS",,1,2,.65,1,2," ",,2,3,,1,48,144,37.6,1,,2.5,1,1,3," ",2," ",,30,2,1320.000000000015,4,5,2015,2,2015,2
"RASRDH0036115",361,14022,1,"Nyanza",47,29,42,"RACHUONYO SOUTH","HOMA BAY",4,2,2,2,2,2,2," ",0,2,2," ",5.1,,50,146,37.7,1,1,1,1,1,1," ",,55200.00000000001,56100.00000000004,"SYRUP PCM 2.5MLS STAT",,1,2,.75,1,2," ",,2,3,,1,51,148,36.9,0,,,1,1,2," ",2," ",,48,2,900.0000000000364,2,3,2015,2,2015,2
"RASRDH0038715",387,14022,2,"Nyanza",1,20,30,"RACHUONYO SOUTH","HOMA BAY",4,2,2,2,2,2,2," ",0,2,2," ",3.4,,42,146,37.7,1,1,1,1,1,1," ",,42959.99999999998,44100.00000000003,"SYR PCM 1.5MLS",,1,2,.45,1,2," ",,1,3,2,1,36,138,37.2,0,,,1,1,2," ",2," ",,1,2,1140.000000000051,3,3,2015,3,2015,3
"RASRDH0032115",321,14022,1,"Nyanza",43,36,41,"RACHUONYO SOUTH","HOMA BAY",4,2,2,2,2,2,2," ",0,2,2," ",5,,48,140,37.7,1,1,1,1,1,1," ",,40919.99999999999,41999.99999999999,"PCM 2.5MLS",,1,2,.75,1,2," ",,2,3,,1,56,144,37.6,1,,2.5,1,1,2," ",2," ",,43,2,1080.000000000007,3,3,2015,1,2015,1
"RASRDH0031815",318,14022,1,"Nyanza",51,26,35,"RACHUONYO SOUTH","HOMA BAY",4,2,2,2,2,2,2," ",0,2,2," ",5.1,,48,140,37.7,1,1,1,1,1,1," ",,41400.00000000004,42179.99999999996,"PCM 2.5MLS",,1,2,.75,1,2," ",,2,3,,1,50,142,37.5,1,,2.5,1,1,3," ",2," ",,51,2,779.99999999992,2,4,2015,1,2015,1
"RASRDH0039015",390,14022,2,"Nyanza",14,26,34,"RACHUONYO SOUTH","HOMA BAY",5,2,2,2,2,2,2," ",0,2,2," ",3.4,,46,140,37.7,1,1,1,1,1,1," ",,45900,46800.00000000003,"SYR PCM 1.5MLS",,1,2,.45,1,2," ",,1,3,2,1,46,142,37,0,,,1,1,3," ",2," ",,15,2,900.0000000000291,2,5,2015,3,2015,3
"RASRDH0026214",262,14022,2,"Nyanza",47,31,35,"RACHUONYO SOUTH","HOMA BAY",4,2,2,2,2,2,2," ",0,2,2," ",6.5,,48,138,37.7,1,1,1,1,1,1," ",,49199.99999999996,50099.99999999999,"SYRUP PCM 3MLS STAT",,1,2,.9,1,2," ",,2,3,,1,50,140,37.8,1,,3,1,1,2," ",2," ",,48,2,900.0000000000364,2,3,2014,12,2014,12
"RASRDH0029815",298,14022,2,"Nyanza",0,27,34,"RACHUONYO SOUTH","HOMA BAY",4,2,2,2,2,2,2," ",0,2,2," ",3,,54,154,37.6,1,1,1,1,1,1," ",,44999.99999999997,45779.99999999999,"SYR PCM 1.5MLS",,1,2,.45,1,2," ",,2,3,2,1,56,150,37.7,1,,1.5,1,1,3," ",2," ",,0,2,780.0000000000218,2,4,2015,1,2015,1
"RASRDH0023914",239,14022,2,"Nyanza",1,32,36,"RACHUONYO SOUTH","HOMA BAY",4,2,2,2,2,2,2," ",0,2,2," ",3.3,,58,152,37.6,1,1,1,1,1,1," ",,39299.99999999999,40200.00000000002,"PCM SYRUP 1.5 MLS",,1,2,.45,1,2," ",,2,3,2,1,54,148,37.2,1,,1.5,1,1,2," ",2," ",,1,2,900.0000000000218,2,3,2014,11,2014,11
"RASRDH0023214",232,14022,2,"Nyanza",1,25,34,"RACHUONYO SOUTH","HOMA BAY",4,2,2,2,2,2,2," ",0,2,2," ",3.5,,58,150,37.6,1,1,1,1,1,1," ",,35279.99999999997,36000.00000000004,"PCM SYRUP 2MLS",,1,2,.5,1,2," ",,2,3,2,1,54,148,37.2,1,,2,1,1,3," ",2," ",,1,2,720.0000000000655,2,4,2014,11,2014,11
"RASRDH0029315",293,14022,2,"Nyanza",1,35,39,"RACHUONYO SOUTH","HOMA BAY",5,2,2,2,2,2,2," ",0,2,2," ",2.6,,56,150,37.6,1,1,1,1,1,1," ",,40200.00000000002,40919.99999999999,"PCM SYR 1.5MLS STAT",,1,2,.35,1,2," ",,2,3,2,1,54,148,37.2,1,,1.5,1,1,2," ",2," ",,1,2,719.9999999999709,2,3,2015,1,2015,1
"RASRDH0086716",850,14022,2,"Nyanza",2,35,38,"RACHUONYO SOUTH","HOMA BAY",5,2,2,2,2,2,2," ",0,2,1," ",3.4,,62,149,37.6,1,1,1,1,1,1," ",,42299.99999999996,43200,"Paracetamol Syrup",1.5,1,2,.45,1,2," ",,1,3,,1,60,148,37.2,0,,,1,1,3," ",2," ",,2,2,900.0000000000364,2,7,2016,5,2016,5
"RASRDH0033815",338,14022,1,"Nyanza",2,32,55,"RACHUONYO SOUTH","HOMA BAY",4,2,2,2,2,2,2," ",0,2,2," ",3.5,,58,148,37.6,1,1,1,1,1,1," ",,41999.99999999999,42900.00000000002,"SYR PCM 1.5",,1,2,.5,1,2," ",,2,3,,1,54,144,37.6,1,,2,1,1,1," ",2," ",,2,2,900.0000000000218,2,0,2015,2,2015,2
"RASRDH0028214",282,14022,2,"Nyanza",2,36,48,"RACHUONYO SOUTH","HOMA BAY",4,2,2,2,2,2,2," ",0,2,2," ",2.9,,58,148,37.6,1,1,1,1,1,1," ",,44400.00000000001,45119.99999999998,"PCM SYRUP 1.5",,1,2,.35,1,2," ",,2,3,2,1,54,142,37.4,1,,1.5,1,1,3," ",2," ",,2,2,719.9999999999709,2,4,2014,12,2014,12
"RASRDH0029215",292,14022,2,"Nyanza",1,26,34,"RACHUONYO SOUTH","HOMA BAY",4,2,2,2,2,2,2," ",0,2,2," ",2.6,,54,148,37.6,1,1,1,1,1,1," ",,39179.99999999998,39780.00000000003,"PCM SYR 1.5MLS",,1,2,.35,1,2," ",,1,2,3,1,56,150,37.6,1,,1.5,1,1,4,"8",2," ",,1,2,600.0000000000509,1,8,2015,1,2015,1
"RASRDH0044715",447,14022,1,"Nyanza",46,26,29,"RACHUONYO SOUTH","HOMA BAY",4,2,2,2,2,2,2," ",0,2,2," ",5.7,,52,148,37.6,1,1,1,1,1,1," ",,50099.99999999999,50880.00000000002,"SYRUP PCM 3MLS STAT",,1,2,.85,1,2," ",,2,3,,1,56,150,37.5,0,,0,1,0,," ",," ",,46,2,780.0000000000218,2,,2015,3,2015,3
"RASRDH0054915",549,14022,1,"Nyanza",42,19,22,"RACHUONYO SOUTH","HOMA BAY",4,2,2,2,2,2,2," ",0,2,2," ",4.5,,52,148,37.6,1,1,1,1,1,1," ",,46199.99999999999,46800.00000000003,"Paracetamol Syrup",2.5,1,2,.65,1,2," ",,2,3,,1,54,148,37.4,0,,,1,1,2," ",2," ",,43,2,600.0000000000437,1,3,2015,7,2015,7
"RASRDH0053015",530,14022,1,"Nyanza",1,19,23,"RACHUONYO SOUTH","HOMA BAY",5,2,2,2,2,2,2," ",0,2,2," ",3.4,,50,148,37.6,1,1,1,1,1,1," ",,45840.00000000004,46499.99999999996,"PCM SYRUP STAT",2,1,2,.45,1,2," ",,2,3,,1,54,150,37.4,0,,0,1,0,," ",," ",,1,2,659.9999999999127,2,,2015,6,2015,6
"RASRDH0032315",323,14022,1,"Nyanza",29,22,28,"RACHUONYO SOUTH","HOMA BAY",4,2,2,2,2,2,2," ",0,2,2," ",5,,50,148,37.6,1,1,1,1,1,1," ",,40019.99999999996,40799.99999999999,"PCM SYRUP 2.5MLS",,1,2,.75,1,2," ",,2,3,,1,54,150,37.1,1,,2.5,1,1,2," ",2," ",,30,2,780.0000000000218,2,2,2015,1,2015,1
"RASRDH0026314",263,14022,2,"Nyanza",0,24,26,"RACHUONYO SOUTH","HOMA BAY",4,2,2,2,2,2,2," ",0,2,2," ",2.6,,52,146,37.6,1,1,1,1,1,1," ",,47699.99999999997,48479.99999999999,"SYRUP PCM 1ML",,1,2,.35,1,2," ",,2,3,2,1,58,148,37.4,1,,1,1,1,3," ",2," ",,0,2,780.0000000000218,2,6,2014,12,2014,12
"RASRDH0028715",287,14022,1,"Nyanza",4,35,38,"RACHUONYO SOUTH","HOMA BAY",4,2,2,2,2,2,2," ",0,2,2," ",2.5,,52,142,37.6,1,1,1,1,1,1," ",,51899.99999999996,52679.99999999999,"PCM 1ML",,1,2,.35,1,2," ",,2,3,,1,54,148,37.4,1,,1,1,1,1," ",2," ",,5,2,780.0000000000291,2,3,2015,1,2015,1
"RANKDH0040016",384,13667,2,"Nyanza",29,28,36,"RACHUONYO NORTH","HOMA BAY",4,2,2,2,2,2,2," ",0,2,2," ",6,,48,142,37.6,1,1,1,1,1,1," ",,44579.99999999999,45239.99999999999,"Paracetamol Syrup",3,1,2,.85,1,2," ",,1,3,,1,52,148,36,0,,,1,1,2," ",2," ",,30,1,660.0000000000073,2,3,2016,6,2016,6
"RASRDH0023814",238,14022,1,"Nyanza",41,27,30,"RACHUONYO SOUTH","HOMA BAY",4,2,2,2,2,2,2," ",0,1,2," ",4,,52,140,37.6,1,1,1,1,1,1," ",,50580.00000000003,51300,"PCM SYRUP, 2 MLS STAT",,1,2,.6,1,2," ",,2,3,,1,54,144,37.2,1,,2,1,1,3," ",2," ",,41,2,719.9999999999709,2,4,2014,11,2014,11
"RASRDH0034815",348,14022,2,"Nyanza",44,36,51,"RACHUONYO SOUTH","HOMA BAY",5,2,2,2,2,2,2," ",0,2,1," ",5.6,,48,140,37.6,1,1,1,1,1,1," ",,42600.00000000004,43379.99999999997,"SYR PCM 3MLS STAT",,1,2,.85,1,2," ",,1,2,3,1,50,144,37.4,1,,3,1,1,3," ",2," ",,45,2,779.9999999999272,2,5,2015,2,2015,2
"RASRDH0057915",579,14022,2,"Nyanza",42,23,30,"RACHUONYO SOUTH","HOMA BAY",1,2,2,2,2,2,2," ",0,2,2," ",,,68,138,37.6,1,1,1,1,1,1,"THE BABY HAS FEVER OF 37.6 ON FIRST VISIT",,50399.99999999997,51540.00000000002,"PCM SYP STAT",2.5,1,2,.65,1,2," ",,1,3,2,1,66,136,36.2,0,,0,1,0,," ",," ",,43,2,1140.000000000051,3,,2015,8,2015,8
"RASRDH0026414",264,14022,2,"Nyanza",22,24,27,"RACHUONYO SOUTH","HOMA BAY",4,2,2,2,2,2,2," ",0,2,2," ",3.5,,50,138,37.6,1,1,1,1,1,1," ",,52200.00000000003,53099.99999999997,"PCM SYRUP 2MLS STAT",,1,2,.5,1,2," ",,1,2,3,1,52,140,37.4,1,,2,1,1,3," ",2," ",,23,2,899.9999999999418,2,5,2014,12,2014,12
"RASRDH0056315",563,14022,1,"Nyanza",44,29,30,"RACHUONYO SOUTH","HOMA BAY",4,2,2,2,2,2,2," ",0,2,2," ",4.8,,38,134,37.6,1,1,1,1,1,1," ",,48600,49199.99999999996,"SYR PCM",2.5,1,2,.65,1,2," ",,2,3,,1,40,130,37.4,0,,,1,0,," ",," ",,44,2,599.9999999999563,1,,2015,7,2015,7
"RASRDH0023414",234,14022,1,"Nyanza",9,23,31,"RACHUONYO SOUTH","HOMA BAY",4,2,2,2,2,2,2," ",0,2,2," ",3.8,,52,130,37.6,1,1,1,1,1,1," ",,39000.00000000001,39900.00000000004,"PCM SYRUP, 2MLS STAT",,1,2,.5,1,2," ",,2,3,,1,54,140,37.2,1,,2,1,1,3," ",2," ",,9,2,900.0000000000364,2,5,2014,11,2014,11
"RASRDH0022914",229,14022,2,"Nyanza",42,27,37,"RACHUONYO SOUTH","HOMA BAY",4,2,2,2,2,2,2," ",0,2,2," ",3.9,,42,130,37.6,1,1,1,1,,1," ",,46859.99999999999,47699.99999999997,"PCM SYRUP 2MLS",,1,2,.5,1,2," ",,2,3,,1,44,136,37.4,1,,2,1,1,3," ",2," ",,42,2,839.9999999999855,2,4,2014,11,2014,11
"RASRDH0055915",559,14022,2,"Nyanza",42,37,39,"RACHUONYO SOUTH","HOMA BAY",5,2,2,2,2,2,2," ",0,2,2," ",4.7,,38,130,37.6,1,1,1,1,1,1," ",,49500.00000000003,50099.99999999999,"Paracetamol Syrup",2.5,1,2,.65,1,2," ",,2,3,,1,40,134,37.4,0,,,1,1,3," ",2," ",,42,2,599.9999999999636,1,5,2015,7,2015,7
"RASRDH0087916",863,14022,2,"Nyanza",3,25,31,"RACHUONYO SOUTH","HOMA BAY",5,2,2,2,2,2,2," ",0,2,2," ",3,,60,162,37.5,1,1,1,1,1,1," ",,47699.99999999997,48540.00000000004,"PCM, VIT K 1ML",1.5,1,2,.45,1,2," ",,1,3,,1,60,160,37.6,0,,0,1,1,2," ",2," ",,3,2,840.0000000000728,2,3,2016,6,2016,6
"RASRDH0043115",431,14022,2,"Nyanza",0,25,33,"RACHUONYO SOUTH","HOMA BAY",5,2,2,2,2,2,2," ",0,2,2," ",3.5,,61,159,37.5,2,1,1,1,1,2,"DEFFERED DUE TO RESPIRATORY DISTRESS AND REFUSED TO BE BREA",6,,," ",,,,,,," ",,,,,,,,,,,,,0,," ",," ",,0,2,,,,2015,3,,
"RASRDH0020814",208,14022,2,"Nyanza",0,32,36,"RACHUONYO SOUTH","HOMA BAY",4,2,2,2,2,2,2," ",0,2,2," ",3.4,,48,150,37.5,1,1,1,1,1,1," ",,39780.00000000003,40440.00000000004,"SYR PCM",,1,2,.45,1,2," ",,2,3,3,1,50,152,37.2,1,,1.5,1,1,2," ",2," ",,0,2,660.0000000000146,2,2,2014,10,2014,10
"RASRDH0041115",411,14022,2,"Nyanza",1,19,25,"RACHUONYO SOUTH","HOMA BAY",5,2,2,2,2,2,2," ",0,2,2," ",3.5,,48,142,37.5,1,1,1,1,1,1," ",,41099.99999999996,41999.99999999999,"PCM 2MLS GIVEN",,1,2,.5,1,2," ",,1,3,2,1,46,140,37.2,0,,0,1,1,3," ",2," ",,1,2,900.0000000000364,2,5,2015,3,2015,3
"RASRDH0050715",507,14022,1,"Nyanza",45,27,29,"RACHUONYO SOUTH","HOMA BAY",4,2,2,2,2,2,2," ",0,2,2," ",5.6,,50,140,37.5,1,1,1,1,1,1," ",,46680.00000000002,47399.99999999999,"SRP PCM 3MLS STAT",,1,2,.85,1,2," ",,2,3,,1,52,144,37.3,0,,0,2,1,3," ",2," ",,45,2,719.9999999999709,2,5,2015,5,2015,5
"RASRDH0060415",603,14022,2,"Nyanza",35,31,38,"RACHUONYO SOUTH","HOMA BAY",4,2,2,2,2,2,2," ",0,2,2," ",5,,32,132,37.5,1,1,1,1,1,1," ",,38820.00000000004,39479.99999999996,"PCM SYR",2.5,1,2,.75,1,2," ",,1,2,3,1,37,130,37,0,,0,1,0,," ",," ",,35,2,659.9999999999127,2,,2015,8,2015,8
"RASKOK0005314",0,13712,2,"Nyanza",42,34,36,"RACHUONYO SOUTH","HOMA BAY",4,2,1,2,2,2,2," ",0,2,2," ",,,,,37.5,2,1,1,1,1,2,"FEBRILE. HAS BEEN UNWELL FOR THE PAST FEW DAYS.",4,,," ",,,,,,," ",,,,,,,,,,,,,0,," ",," ",,42,2,,,,2014,10,,
"RASRDH0029615",296,14022,2,"Nyanza",1,37,39,"RACHUONYO SOUTH","HOMA BAY",4,2,2,2,2,2,2," ",0,2,2," ",3,,58,150,37.4,1,1,1,1,1,1," ",,41940.00000000003,42600.00000000004,"SYR 1.5MLS",,1,2,.45,1,2," ",,1,2,3,1,54,148,37.2,1,,1.5,1,1,3," ",2," ",,1,2,660.0000000000146,2,6,2015,1,2015,1
"RASRDH0030315",303,14022,1,"Nyanza",0,36,40,"RACHUONYO SOUTH","HOMA BAY",4,2,2,2,2,2,2," ",0,2,2," ",2.5,,54,148,37.4,2,1,1,1,2,2,"Baby Underweight",5,,," ",,,,,,," ",,,,,,,,,,,,,0,," ",," ",,0,2,,,,2015,1,,
"RASRDH0029415",294,14022,2,"Nyanza",1,35,35,"RACHUONYO SOUTH","HOMA BAY",5,2,2,2,2,2,2," ",0,2,2," ",3.4,,54,148,37.4,1,1,1,1,1,2,"DEFFERED DUE TO HYPOGLYCEMIA",7,,," ",,,,,,," ",,,,,,,,,,,,,0,," ",," ",,1,2,,,,2015,1,,
"RASRDH0022214",222,14022,1,"Nyanza",1,21,41,"RACHUONYO SOUTH","HOMA BAY",4,2,2,2,2,2,2," ",0,2,2," ",3.5,,52,148,37.4,1,1,1,1,1,1," ",,46499.99999999996,47399.99999999999,"PCM SYRUP, 2 MLS",,1,2,.5,1,2," ",,2,3,3,1,50,150,37.2,1,,2,1,1,3," ",2," ",,1,2,900.0000000000364,2,5,2014,11,2014,11
"RASRDH0020014",200,14022,2,"Nyanza",1,22,26,"RACHUONYO SOUTH","HOMA BAY",4,2,2,2,2,2,2," ",0,2,1," ",3.4,,52,148,37.4,1,1,1,1,1,1," ",,36000.00000000004,36660.00000000004,"SYR PCM",,1,2,.45,1,2," ",,1,2,3,1,49,146,37,1,,1.5,1,0,," ",," ",,1,2,660.0000000000073,2,,2014,10,2014,10
"RASRDH0020714",207,14022,2,"Nyanza",5,24,33,"RACHUONYO SOUTH","HOMA BAY",4,2,2,2,2,2,2," ",0,2,2," ",3.7,,46,148,37.4,1,1,1,1,1,1," ",,42600.00000000004,43200,"SYR PCM",,1,2,.5,1,2," ",,2,3,2,1,48,150,37.2,1,,2,1,1,3," ",2," ",,5,2,599.9999999999563,1,4,2014,10,2014,10
"RASRDH0020314",203,14022,2,"Nyanza",0,18,21,"RACHUONYO SOUTH","HOMA BAY",4,2,2,2,2,2,2," ",0,2,2," ",3,,52,146,37.4,1,1,1,1,1,1," ",,41400.00000000004,41999.99999999999,"SYR PCM",,1,2,.45,1,2," ",,2,3,2,1,58,148,36.2,1,,1.5,1,1,3," ",2," ",,0,2,599.9999999999563,1,5,2014,10,2014,10
"RASRDH0022014",220,14022,2,"Nyanza",27,18,22,"RACHUONYO SOUTH","HOMA BAY",4,2,2,2,2,2,2," ",0,2,2," ",4.8,,48,146,37.4,1,1,1,1,1,1," ",,45600.00000000002,46499.99999999996,"PARACETAMOL SYRUP 2.5 MLS",,1,2,.65,1,2," ",,1,2,3,1,50,148,37.2,1,,2.5,1,1,3," ",2," ",,28,2,899.9999999999418,2,5,2014,11,2014,11
"RASOBR0005314",50,13953,2,"Nyanza",9,24,31,"RACHUONYO SOUTH","HOMA BAY",4,2,2,2,2,2,2," ",0,2,2," ",2.7,,48,146,37.4,1,1,1,1,1,1," ",,42839.99999999997,43499.99999999999,"SYR PCM",,1,2,.35,1,2," ",,2,3,,1,56,148,37,1,,1.5,1,1,2," ",2," ",,10,2,660.0000000000146,2,3,2014,10,2014,10
"RASRDH0025514",255,14022,2,"Nyanza",4,29,36,"RACHUONYO SOUTH","HOMA BAY",4,2,2,2,2,2,2," ",0,2,2," ",3.5,,48,146,37.4,1,1,1,1,1,1," ",,41700.00000000001,42539.99999999999,"PCM SYRUP 2MLS",,1,2,.5,1,2," ",,2,3,2,1,50,148,37,1,,2,1,1,2," ",2," ",,5,2,839.9999999999855,2,3,2014,12,2014,12
"RASRDH0031915",319,14022,1,"Nyanza",5,30,32,"RACHUONYO SOUTH","HOMA BAY",4,2,2,2,2,2,2," ",0,2,2," ",3.45,,50,144,37.4,1,1,1,1,1,1," ",,43499.99999999999,44520.00000000002,"PCM 1.5",,1,2,.45,1,2," ",,2,3,,1,54,148,37.2,1,,1.5,1,1,3," ",2," ",,5,2,1020.000000000029,3,4,2015,1,2015,1
"RASRDH0047015",470,14022,2,"Nyanza",5,23,31,"RACHUONYO SOUTH","HOMA BAY",4,2,2,2,2,2,2," ",0,2,2," ",3.2,,50,144,37.4,1,1,1,1,1,1," ",,42480.00000000003,43200,"SYR PCM 1.5MLS",,1,2,.45,1,2," ",,2,3,,1,52,146,37.2,0,,,1,0,," ",," ",,5,2,719.9999999999709,2,,2015,4,2015,4
"RASRDH0075916",753,14022,1,"Nyanza",4,30,40,"RACHUONYO SOUTH","HOMA BAY",5,2,2,2,2,2,2," ",0,2,2," ",3.75,,74,142,37.4,1,1,1,1,1,1," ",,48300.00000000002,49139.99999999999,"PCM, VIT K 1MG",2,1,2,.5,1,2," ",,1,3,,1,72,138,36.4,0,,0,1,1,2," ",2," ",,4,2,839.9999999999782,2,3,2016,2,2016,2
"RASRDH0028414",284,14022,1,"Nyanza",59,31,36,"RACHUONYO SOUTH","HOMA BAY",4,2,2,2,2,2,2," ",0,2,2," ",4.9,,58,142,37.4,1,1,1,1,1,1," ",,46199.99999999999,47100.00000000001,"PCM SY 2.5MLS",,1,2,.65,1,2," ",,2,3,,1,54,144,37.2,1,,2.5,1,1,3," ",2," ",,59,2,900.0000000000218,2,7,2014,12,2014,12
"RASRDH0027214",272,14022,1,"Nyanza",16,31,38,"RACHUONYO SOUTH","HOMA BAY",4,2,2,2,2,2,2," ",0,2,2," ",4,,50,142,37.4,1,1,1,1,1,1," ",,48479.99999999999,49199.99999999996,"SYRUP PCM 2MLS",,1,2,.6,1,2," ",,2,3,,1,52,144,37.2,1,,2,1,1,3," ",2," ",,16,2,719.9999999999636,2,5,2014,12,2014,12
"RASGDB0002714",27,13584,2,"Nyanza",19,36,42,"RACHUONYO SOUTH","HOMA BAY",5,2,2,2,2,2,2," ",0,1,2," ",4,,48,142,37.4,1,1,1,1,1,1," ",,46319.99999999999,47220.00000000002,"SYR PCM",,1,2,.6,1,2," ",,2,3,,1,52,148,37.2,1,,2,1,1,2," ",2," ",,19,2,900.0000000000291,2,3,2014,10,2014,10
"RASRDH0022614",226,14022,1,"Nyanza",54,21,25,"RACHUONYO SOUTH","HOMA BAY",4,2,2,2,2,2,2," ",0,1,2," ",6.1,,48,142,37.4,1,1,1,1,1,1," ",,45480.00000000002,46199.99999999999,"PCM SYRUP 3MLS STAT",,1,2,.9,1,2," ",,1,2,,1,50,146,37.2,1,,3,1,1,2," ",2," ",,55,2,719.9999999999709,2,3,2014,11,2014,11
"RASRDH0025414",254,14022,2,"Nyanza",7,28,34,"RACHUONYO SOUTH","HOMA BAY",4,2,2,2,2,2,2," ",0,2,2," ",4.2,,43,142,37.4,1,1,1,1,1,1," ",,37380.00000000002,38040.00000000002,"PCM SYRUP 2MLS",,1,2,.6,1,2," ",,1,2,3,1,49,147,37,1,,2,1,1,3," ",2," ",,8,2,660.0000000000073,2,4,2014,12,2014,12
"RASRDH0079216",783,14022,2,"Nyanza",1,28,28,"RACHUONYO SOUTH","HOMA BAY",4,2,2,2,2,2,2," ",0,2,2," ",3.5,,61,141,37.4,1,1,1,1,1,1," ",,43079.99999999999,43980.00000000002,"PCM, VIT K 1MG",2,1,2,.5,1,2," ",,1,3,2,2,59,138,37.2,0,,0,1,0,," ",," ",,1,2,900.0000000000291,2,,2016,3,2016,3
"RASRDH0034115",341,14022,2,"Nyanza",23,27,34,"RACHUONYO SOUTH","HOMA BAY",4,2,2,2,2,2,2," ",0,2,2," ",3.9,,52,140,37.4,1,1,1,1,1,1," ",,41099.99999999996,41879.99999999998,"SYR PCM 2MLS STAT",,1,2,.5,1,2," ",,1,2,3,1,50,144,37.6,1,,2,1,1,3," ",2," ",,24,2,780.0000000000218,2,5,2015,2,2015,2
"RASRDH0030715",307,14022,2,"Nyanza",20,33,36,"RACHUONYO SOUTH","HOMA BAY",4,2,2,2,2,2,2," ",0,2,2," ",4,,52,140,37.4,1,1,1,1,1,1," ",,47100.00000000001,47819.99999999998,"PCM 2MLS",,1,2,.6,1,2," ",,2,3,,1,54,148,37.2,1,,2,1,1,3," ",2," ",,21,2,719.9999999999709,2,6,2015,1,2015,1